program: Gaussian 09
title: 000183693
version: EM64L-G09RevD.01
frameworkgroup: C1[X(C15H15Cl2N3OS)]
method: RPBEPBE
basis: SDD
operation: Freq
keyword: #p
keyword: freq=noraman
keyword: PBEPBE/SDD
title: #p freq=noraman PBEPBE/SDD
converged: YES YES NO NO
title: Mulliken charges:
elementType: Cl Cl S O N N N C C C C C C C C C C C C C C C H H H H H H H H H H H H H H H
charge: -0.004835 0.013895 -0.088793 -0.187259 -0.379280 0.008102 0.003635 0.180198 -0.628143 0.619600 -0.702156 -0.770714 0.363363 0.250930 -0.218499 -0.369761 -0.472918 -0.356144 -0.266329 -0.289715 -0.234546 -0.106523 0.261979 0.200792 0.240077 0.229454 0.217458 0.249383 0.217119 0.232712 0.291056 0.250250 0.295909 0.237068 0.234806 0.320030 0.157799
chargesum: 0.00000
title: Mulliken charges with hydrogens summed into heavy atoms:
elementType: Cl Cl S O N N N C C C C C C C C C C C C C C C
charge: -0.004835 0.013895 0.069006 -0.187259 -0.059250 0.008102 0.003635 0.180198 -0.165372 0.619600 -0.015167 -0.071500 0.363363 0.250930 0.072557 -0.119511 -0.472918 -0.060235 -0.029261 -0.289715 0.000261 -0.106523
polarizability: 2.54910035e+02 1.51575765e+01 2.30030469e+02 3.81181264e+01 4.40766831e+00 1.83067745e+02
1716.lowfreq: -7.4340 -3.5339 -3.0732 -0.0011 -0.0005 0.0019 12.5645 25.9265 37.0129
frequency: 12.3171 25.9137 36.9730 41.0364 65.6336 79.4279 84.3691 99.2858 153.8427 163.4141 173.0753 195.5765 205.6759 217.5997 228.4262 233.2774 258.3389 283.3055 309.5916 316.0304 347.5660 350.7209 357.5794 371.6838 398.4044 409.6749 434.1190 447.4924 453.9868 482.9649 514.1070 531.0552 540.2238 560.9951 596.6597 610.1547 624.1870 626.7681 647.9876 718.2408 745.9416 751.5149 770.0831 792.3806 820.6613 846.1438 854.7266 866.4518 885.4090 894.8323 906.5214 934.9111 956.7021 963.3315 996.4241 997.3846 1006.2559 1030.0081 1051.8642 1075.2747 1106.1391 1118.9264 1137.8910 1145.6547 1166.7512 1179.8788 1181.1130 1196.7256 1247.9977 1264.5146 1280.7673 1306.0754 1313.2525 1326.4283 1375.3222 1380.7139 1401.1001 1439.3562 1443.8864 1457.0570 1469.2087 1475.6320 1489.5795 1497.3944 1501.8529 1518.2678 1529.4802 1594.6505 1615.0916 1677.8091 2494.2133 2970.6048 2981.1995 2989.7884 3064.5126 3069.7174 3079.0900 3087.1021 3117.2302 3130.9664 3144.0358 3165.9188 3191.1348 3208.0435 3534.9146
redmass: 9.1630 10.7880 6.8809 11.0383 9.2099 6.8082 8.9440 4.6682 4.5263 5.3295 5.0155 1.7312 1.4580 1.8737 2.4583 4.1011 6.2819 3.9169 4.6612 22.8483 5.3714 3.3520 4.5695 1.1833 4.7994 3.4319 3.4546 3.2865 4.5156 4.0604 3.4631 3.5997 5.1705 5.1763 6.4659 3.7639 1.7854 4.8598 6.8542 3.9086 4.8887 4.4569 1.3983 3.8392 2.6338 4.8602 3.1877 1.6704 1.6164 1.7818 1.5093 1.4999 1.8526 1.3794 3.7831 1.5926 1.3785 5.1904 2.2252 2.4771 3.1039 2.6758 3.1525 2.2510 2.2783 1.3944 1.8295 1.8855 2.8765 2.3989 2.1307 1.5435 1.5552 2.8442 5.3209 1.1986 1.2028 2.3675 8.6033 1.7966 1.1001 1.0595 1.1452 1.1733 1.2010 1.5588 5.2154 5.2242 5.7838 7.2622 1.0383 1.0692 1.0365 1.0377 1.0910 1.0989 1.0990 1.1004 1.0979 1.0871 1.0904 1.0981 1.0954 1.0920 1.0757
irintensity: 0.8416 0.4751 4.5753 0.4252 1.0315 0.8879 1.1758 0.7826 0.9787 0.7952 1.5078 4.0049 26.6049 31.5109 2.3765 9.3833 8.5991 0.8171 0.9574 0.1085 0.8650 0.1510 0.7203 0.0935 2.0553 0.7814 2.8389 2.8384 7.1749 22.3681 4.0433 14.1179 33.3250 34.8090 5.8271 4.3784 47.7733 8.5417 4.8171 26.5217 21.3474 18.7913 83.3770 9.9175 3.0632 60.7435 5.6602 23.6154 0.7035 3.2359 9.8590 5.2476 4.0823 3.6674 6.9860 0.6165 4.4725 14.9448 6.4521 34.2021 150.2628 91.3075 46.0927 53.1319 7.4850 3.8076 7.1634 7.7197 21.5991 66.4127 71.7172 74.8597 6.6048 47.7323 44.8635 19.8341 19.3871 152.2447 8.0992 39.1567 9.8981 0.8978 43.6965 23.1011 36.3923 260.8472 64.3943 74.0848 3.5464 234.4312 1.9763 40.5256 11.7214 34.7319 5.5423 13.9630 48.5664 19.9926 7.9653 3.8105 13.5758 16.5226 4.7619 0.2358 41.8943
temp: 298.150 k
press: 1.00000 atm
elementType: 17 17 16 8 7 7 7 6 6 6 6 6 6 6 6 6 6 6 6 6 6 6 1 1 1 1 1 1 1 1 1 1 1 1 1 1 1
symmnumber: 1
zpe: 708317.8 jmol-1
zpe.correction: 0.269784 hartree
zpe.thermalcorrener: 0.291632 hartree
zpe.thermalcorrenthalpy: 0.292576 hartree
zpe.thermalcorrgfe: 0.216510 hartree
zpe.sumelectzpe: -2136.621317 hartree
zpe.sumelectthermal: -2136.599469 hartree
zpe.sumelectthermalent: -2136.598525 hartree
zpe.sumelectthermalfe: -2136.674591 hartree
dipole: -3.0663 -2.4259 -1.8727
dipole: 4.3352
quadrupole: -184.7735 -149.3989 -147.5013
quadrupole: 2.1521 -0.3718 5.8743
quadrupole: -24.2156 11.1590 13.0566 2.1521 -0.3718 5.8743
hfenergy: -2136.8911008 hartree
pointgroup: C01[X(C15H15Cl2N3O1S1)]
dipole: 1.0536319 -1.3337676 0.141347 debye
polarizability: 245.9144956|-36.1912793|229.2705656|27.3394822|15.444403|192.8231882 unknown
InChI: InChI=1S/C15H15Cl2N3OS/c1-15(2,10-7-12(16)19-20-13(10)17)8-9-5-3-4-6-11(9)18-14(21)22/h3-7,18,22H,8H2,1-2H3
charge 0 multiplicity 1
37 atoms
Cl -2.754733 -1.083751 -2.588379
Cl -3.479109 1.464601 3.106887
S  4.845144 -2.296702 0.87156
O  4.858314 0.471942 1.10218
N  3.016664 -0.517347 -0.006285
N  -3.913431 0.307103 -0.670942
N  -4.128504 0.897152 0.559014
C  -0.563789 -1.663052 -0.107933
C  0.380008 -1.069122 -1.235635
C  -1.799766 -0.758488 0.098437
C  -1.022826 -3.092976 -0.534471
C  0.238223 -1.817414 1.211509
C  0.930064 0.333797 -0.983814
C  2.196521 0.597113 -0.367419
C  -2.036812 -0.125911 1.33932
C  0.154697 1.448321 -1.392561
C  -2.818969 -0.460686 -0.867884
C  2.631269 1.930947 -0.14644
C  0.577216 2.776162 -1.175415
C  -3.191834 0.669716 1.506745
C  1.817232 3.010796 -0.541782
C  4.223495 -0.513177 0.666339
H  -0.183764 -1.059051 -2.183731
H  1.180914 -1.822087 -1.388184
H  -1.561767 -3.098973 -1.494147
H  -1.67897 -3.53616 0.236063
H  -0.135169 -3.744063 -0.637079
H  0.669638 -0.864852 1.5650
H  1.072205 -2.524871 1.051988
H  -0.386627 -2.246379 2.015947
H  -1.341296 -0.23862 2.170577
H  -0.795306 1.266665 -1.90803
H  3.597319 2.107667 0.329921
H  -0.04936 3.612282 -1.50188
H  2.16256 4.034711 -0.363302
H  2.652408 -1.435568 -0.266529
H  5.963737 -1.914321 1.582354
