program: Gaussian 09
title: 000183691
version: EM64L-G09RevD.01
frameworkgroup: C1[X(C15H24O2)]
method: RPBEPBE
basis: SDD
operation: Freq
keyword: #pfreq=noraman
keyword: PBEPBE/SDD
title: #p freq=noraman PBEPBE/SDD
converged: YES YES NO NO
title: Mulliken charges:
elementType: O O C C C C C C C C C C C C C C C H H H H H H H H H H H H H H H H H H H H H H H H
charge: -0.461924 -0.451230 0.213617 -0.196906 -0.183374 -0.094000 -0.542571 -0.534331 -0.466678 0.459256 -0.150602 0.489745 -0.846260 -0.830466 -0.735413 -0.614849 -0.740003 0.199963 0.219111 0.192161 0.198085 0.229256 0.237493 0.226656 0.243807 0.241649 0.241108 0.350627 0.231304 0.242146 0.226579 0.235936 0.219836 0.225512 0.219210 0.215027 0.359089 0.207145 0.282364 0.212983 0.228943
chargesum: 0.00000
title: Mulliken charges with hydrogens summed into heavy atoms:
elementType: O O C C C C C C C C C C C C C C C
charge: -0.111297 -0.092141 0.213617 0.003057 0.035737 0.098161 -0.115231 -0.070182 0.018777 0.459256 0.090506 0.489745 -0.146231 -0.149183 -0.301176 -0.125340 -0.298076
polarizability: 1.77714809e+02 5.38105338e+00 1.69316498e+02 1.11227783e+01 2.05866470e+01 1.46130657e+02
1716.lowfreq: -22.7056 -14.7127 -4.7529 -0.0010 -0.0006 -0.0006 27.9150 49.6788 66.5597
frequency: 27.6810 49.6722 66.5047 89.2337 104.1210 123.9496 138.8060 150.5922 165.0649 181.5168 200.5440 214.4757 243.1366 253.3480 277.4243 284.9455 292.1929 308.6915 339.8118 370.4023 375.7068 406.0889 414.3100 449.9096 462.8421 471.9342 503.3416 525.9621 553.7922 574.0519 617.4790 657.2363 688.5983 704.4355 725.3748 730.6511 817.6708 852.7586 886.1356 897.8092 907.1298 924.6847 926.8406 939.4182 949.0904 952.6024 962.4321 982.9059 991.6064 1003.4279 1004.3307 1013.8015 1028.2536 1029.6542 1046.9888 1047.5747 1072.8718 1097.5947 1112.2602 1117.0165 1135.2029 1145.8334 1205.1361 1236.1176 1238.1203 1252.9020 1263.7628 1276.7470 1286.0397 1302.9639 1307.4407 1324.3628 1330.5365 1337.0471 1350.7440 1353.7835 1360.6515 1392.9019 1393.3549 1414.6720 1416.8915 1426.1370 1430.2821 1458.6004 1460.7493 1468.1155 1473.4771 1477.7961 1479.0527 1493.2162 1637.4342 1660.5694 1662.5479 2910.8274 2949.6085 2963.2832 2966.3448 2980.3639 2987.8537 2993.7063 3008.6581 3037.1964 3040.1041 3046.3908 3061.7849 3065.7065 3084.2436 3085.7798 3091.4482 3092.0339 3096.9329 3097.4738 3188.5369 3195.6777 3201.9608 3338.2877 3510.5499
redmass: 2.6024 4.1449 2.9328 3.2211 3.2504 2.9478 3.1338 1.4814 1.8442 2.0283 1.7179 3.0212 3.2384 4.0049 3.3612 3.4226 2.0523 2.7979 1.9612 3.1771 1.5988 2.7997 3.4177 2.6796 3.1131 2.6677 2.6082 2.0726 2.6015 2.2305 2.1031 1.7255 1.3836 1.1519 1.7401 1.3730 3.6011 2.2575 2.2001 2.2099 1.8935 1.3357 1.3556 2.5881 2.9215 1.5286 1.9683 1.8547 1.8852 1.4574 1.5342 2.0164 1.5093 1.6712 1.6179 1.6502 2.6016 2.1568 1.7182 2.8109 2.1282 1.4328 1.4013 1.4912 2.0971 1.6477 1.2801 1.7635 1.3215 1.2652 1.3041 1.3138 1.3036 1.3179 1.6892 1.2667 1.6471 1.2174 1.2099 1.1852 1.1878 1.1895 1.1821 1.0492 1.0613 1.0711 1.0725 1.0612 1.0714 1.0812 4.8190 4.6563 4.7346 1.0807 1.0822 1.0381 1.0377 1.0786 1.0613 1.0685 1.0630 1.0956 1.0969 1.1013 1.0982 1.0788 1.0985 1.0980 1.0712 1.0641 1.1005 1.0630 1.1137 1.1130 1.1148 1.0668 1.0649
irintensity: 0.4755 0.5953 0.5141 0.6287 0.7958 0.7693 4.0759 0.1703 0.8210 0.0258 1.1039 5.3773 3.2334 3.3139 1.8647 0.8997 17.8506 3.3949 43.4757 13.9182 110.3545 45.0326 0.8346 5.5096 5.4624 3.3384 3.9302 9.7746 2.1354 8.1109 1.7796 19.9436 65.5280 1.7340 55.3531 4.3654 3.2872 9.3562 15.6492 15.7988 8.1094 61.5828 68.8499 13.9852 5.2492 18.0389 35.4829 2.2129 4.7338 3.4868 23.0742 1.5267 8.4059 89.5618 2.9961 0.9337 4.6256 3.5728 15.7812 2.8402 22.0728 9.8886 2.4491 2.3470 9.3503 15.5687 8.4990 29.3925 7.6339 0.6148 5.6491 2.0225 7.9701 6.3441 7.3274 3.6888 3.2655 16.9633 28.9234 7.7805 78.3030 2.0979 3.9383 11.4292 21.2712 7.7133 22.8050 15.2723 5.2034 5.3970 17.4144 6.5579 48.3776 19.0632 11.2173 25.9910 27.3959 12.8005 14.6904 48.3266 25.6010 18.0467 22.1469 34.7880 35.3844 18.2818 32.0472 32.2179 21.1044 6.2053 22.7030 8.2077 29.0379 28.1996 9.1459 136.5976 12.1849
temp: 298.150 k
press: 1.00000 atm
elementType: 8 8 6 6 6 6 6 6 6 6 6 6 6 6 6 6 6 1 1 1 1 1 1 1 1 1 1 1 1 1 1 1 1 1 1 1 1 1 1 1 1
symmnumber: 1
zpe: 931631.5 jmol-1
zpe.correction: 0.354840 hartree
zpe.thermalcorrener: 0.373887 hartree
zpe.thermalcorrenthalpy: 0.374831 hartree
zpe.thermalcorrgfe: 0.308675 hartree
zpe.sumelectzpe: -735.021806 hartree
zpe.sumelectthermal: -735.002759 hartree
zpe.sumelectthermalent: -735.001815 hartree
zpe.sumelectthermalfe: -735.067971 hartree
dipole: -0.9623 2.7076 -0.7581
dipole: 2.9718
quadrupole: -97.4634 -114.9368 -107.1523
quadrupole: -3.3667 -0.2141 0.9375
quadrupole: 9.0541 -8.4193 -0.6348 -3.3667 -0.2141 0.9375
hfenergy: -735.3766458 hartree
pointgroup: C01 [X(C15H24O2)]
dipole: -0.4211114 1.0865041 -0.0959548 debye
polarizability: 177.7535132|4.2401718|161.5578947|10.6866575|23.7290632|153.8505565 unknown
InChI: InChI=1S/C15H24O2/c1-6-15(9-16)13(11(4)5)7-12(10(2)3)8-14(15)17/h6,12-14,16-17H,1-2,4,7-9H2,3,5H3
charge 0 multiplicity 1
41 atoms
O  -0.415948 -2.792789 -0.778277
O  -1.67579 -2.237985 1.592201
C  -1.071864 -0.438022 -0.066552
C  -0.531293 1.053767 -0.229497
C  -0.060217 -1.365507 -0.829922
C  1.901089 0.275367 -0.47594
C  0.929816 1.211264 0.276035
C  1.400478 -1.193351 -0.357877
C  -1.16996 -0.850631 1.437961
C  -1.456244 2.147639 0.333507
C  -2.495203 -0.511731 -0.621286
C  3.370263 0.413695 -0.064805
C  -2.265657 2.916279 -0.698774
C  4.366323 -0.371743 -0.905494
C  -1.515091 2.472702 1.654121
C  -2.994337 -1.404148 -1.515539
C  3.791552 1.191577 0.969008
H  -0.501448 1.205652 -1.330881
H  -0.1176 -1.101898 -1.905839
H  1.847583 0.543058 -1.557775
H  0.987261 1.017778 1.364633
H  1.234819 2.264991 0.132406
H  2.014349 -1.873124 -0.974603
H  1.506829 -1.53763 0.690191
H  -1.829277 -0.151376 1.984034
H  -0.185479 -0.87177 1.92949
H  -3.17603 0.241939 -0.192989
H  -0.737539 -2.979701 0.152744
H  -1.589432 3.474321 -1.377136
H  -2.854239 2.233304 -1.340336
H  -2.953381 3.641306 -0.230122
H  4.245797 -1.46313 -0.765754
H  4.220403 -0.170467 -1.985098
H  5.406166 -0.112601 -0.643471
H  -2.168948 3.2769 2.011563
H  -0.902426 1.975755 2.41461
H  -2.585063 -2.273847 1.19135
H  -4.043201 -1.3478 -1.832569
H  -2.371661 -2.197008 -1.943024
H  4.855669 1.269197 1.221934
H  3.103325 1.774469 1.589369
