program: Gaussian 09
title: 000183642
version: EM64L-G09RevD.01
frameworkgroup: C1[X(C15H12O3)]
method: RPBEPBE
basis: SDD
operation: Freq
keyword: #pfreq=noraman
keyword: PBEPBE/SDD
title: #p freq=noraman PBEPBE/SDD
converged: YES YES NO NO
title: Mulliken charges:
elementType: O O O C C C C C C C C C C C C C C C H H H H H H H H H H H H
charge: -0.244454 -0.265273 -0.424045 0.335216 0.168780 0.032050 -0.062949 0.220443 -0.548106 0.320911 -0.377143 -0.169454 -0.362082 -0.399961 -0.240712 -0.239354 -0.244751 -0.512949 0.272263 0.245259 0.264927 0.262287 0.241922 0.222138 0.222664 0.360543 0.226313 0.235001 0.234110 0.226406
chargesum: 0.00000
title: Mulliken charges with hydrogens summed into heavy atoms:
elementType: O O O C C C C C C C C C C C C C C C
charge: -0.244454 -0.265273 -0.063502 0.335216 0.168780 0.032050 -0.062949 0.220443 -0.275844 0.320911 -0.131884 0.095473 -0.099795 -0.158039 -0.018574 -0.016689 -0.018437 0.182569
polarizability: 2.76511064e+02 9.48956849e+00 1.79611986e+02 3.03209408e+00 -1.02813495e+01 8.39367409e+01
1716.lowfreq: -4.2231 -0.0009 -0.0008 -0.0006 4.6828 7.6184 26.1056 53.9780 56.9665
frequency: 26.0839 53.9727 56.9558 92.2893 129.5617 177.3387 195.8712 200.7554 209.8403 254.3320 261.0715 275.2785 293.8495 317.8560 338.7891 405.7876 422.0543 465.7806 503.4187 540.4971 543.0494 596.8063 609.3064 617.0883 651.0615 671.5454 682.1360 702.2356 719.9029 756.7995 776.7989 802.6614 845.3622 849.0924 851.7070 872.0666 922.8003 950.9409 968.2161 974.5749 989.1401 992.9021 1007.9729 1028.7878 1061.4773 1085.8444 1111.1385 1118.4312 1138.5845 1164.0525 1168.5787 1172.6689 1198.0395 1234.4126 1256.4447 1302.1213 1316.8887 1343.1819 1368.4586 1384.3890 1414.6818 1437.1620 1441.8442 1463.0602 1466.3264 1468.3546 1494.4240 1537.0725 1582.9961 1611.3298 1613.3108 1617.7540 2985.8275 3084.8433 3120.7028 3127.9489 3129.4126 3142.6624 3158.8262 3167.4276 3180.1158 3206.1871 3264.3750 3581.9671
redmass: 2.8929 4.5755 5.0423 4.8324 3.6989 2.2653 4.3774 2.9522 1.9278 2.2761 3.8247 2.4706 4.2504 4.1993 5.6199 2.8524 6.1494 6.5426 4.0066 5.1904 6.0023 3.6842 7.2337 6.5607 5.7562 4.9151 7.3967 1.6818 1.8238 2.2235 2.1064 5.6900 1.3815 1.2510 6.8071 1.4836 1.4543 6.8908 4.0417 1.4478 3.9020 1.4951 4.0021 2.4574 2.4533 1.6292 1.2761 2.0166 1.6618 2.4389 1.7306 1.0548 1.1393 1.8049 1.6985 2.1740 1.5616 3.7239 4.0354 7.7539 5.2491 2.7383 1.2833 1.0567 1.2346 2.0594 2.9008 5.1722 5.8766 8.4910 6.0870 8.1859 1.0307 1.1042 1.0844 1.1031 1.0883 1.0941 1.0992 1.0906 1.0957 1.0933 1.1055 1.0660
irintensity: 7.6076 1.5147 0.1454 0.5383 0.7081 0.9385 0.3878 4.8825 1.8478 42.4882 20.3141 52.2669 3.2565 10.1448 12.1351 0.1358 4.5933 5.2244 4.9921 3.2756 5.8734 0.6028 5.3610 1.1307 11.5644 13.1685 21.7639 62.7719 35.0401 63.4030 32.5047 0.6145 3.2575 0.6618 9.2304 22.0183 1.2304 15.8680 35.7555 0.8339 0.0472 0.3052 47.9906 35.2653 118.3705 4.1313 0.5940 3.3191 32.2944 104.0126 55.3544 0.6946 0.8112 43.5048 45.1201 6.7835 25.8412 112.7395 3.2403 14.3016 22.5426 17.1755 14.7927 16.6206 105.5761 51.8025 21.5583 12.4951 11.9938 68.2403 3.6772 2.3376 62.4102 38.7656 3.3757 26.0223 6.2744 36.9092 36.8632 1.7390 6.2959 2.6513 0.4002 24.9746
temp: 298.150 k
press: 1.00000 atm
elementType: 8 8 8 6 6 6 6 6 6 6 6 6 6 6 6 6 6 6 1 1 1 1 1 1 1 1 1 1 1 1
symmnumber: 1
zpe: 600092.7 jmol-1
zpe.correction: 0.228563 hartree
zpe.thermalcorrener: 0.243912 hartree
zpe.thermalcorrenthalpy: 0.244856 hartree
zpe.thermalcorrgfe: 0.185283 hartree
zpe.sumelectzpe: -803.172473 hartree
zpe.sumelectthermal: -803.157124 hartree
zpe.sumelectthermalent: -803.156180 hartree
zpe.sumelectthermalfe: -803.215753 hartree
dipole: -2.8176 -1.9834 -0.1302
dipole: 3.4481
quadrupole: -87.2044 -90.1995 -107.7231
quadrupole: 4.6025 -0.0073 -0.9419
quadrupole: 7.8380 4.8428 -12.6808 4.6025 -0.0073 -0.9419
hfenergy: -803.4010361 hartree
pointgroup: C01 [X(C15H12O3)]
dipole: -1.158991 0.6631212 -0.2394733 debye
polarizability: 276.9875138|0.4986|162.6370826|8.9049152|-37.1139445|100.435194 unknown
InChI: InChI=1S/C15H12O3/c1-17-13-9-12(10-5-3-2-4-6-10)14(16)11-7-8-18-15(11)13/h2-9,16H,1H3
charge 0 multiplicity 1
30 atoms
O  -3.601196 -0.036779 -0.287943
O  -1.98531 -2.636963 0.463095
O  0.525623 2.341711 -0.72354
C  0.628446 -0.027026 -0.111053
C  -1.547363 1.027099 -0.497289
C  -2.19407 -0.202838 -0.189172
C  -0.13361 1.12323 -0.450925
C  -1.475611 -1.372769 0.144364
C  -0.070008 -1.24035 0.167125
C  2.119584 -0.017972 -0.02415
C  -2.607034 1.981846 -0.79802
C  -3.802508 1.312381 -0.662347
C  2.92237 0.734528 -0.925757
C  2.778559 -0.801466 0.964904
C  4.330828 0.693188 -0.846572
C  4.186653 -0.840869 1.045395
C  4.972365 -0.094634 0.136953
C  -3.422142 -2.891615 0.263348
H  0.502235 -2.145778 0.388523
H  -2.507151 3.026612 -1.090601
H  -4.841349 1.605634 -0.786051
H  2.438863 1.351129 -1.687453
H  2.182393 -1.363066 1.693355
H  4.928469 1.276634 -1.556295
H  4.66904 -1.446275 1.821237
H  -0.123261 3.087946 -0.735071
H  6.066165 -0.12294 0.197725
H  -4.03742 -2.252898 0.920462
H  -3.556241 -3.950986 0.528107
H  -3.713814 -2.722811 -0.789057
