program: Gaussian 09
title: 000183625
version: EM64L-G09RevD.01
frameworkgroup: C1[X(C16H20O2)]
method: RPBEPBE
basis: SDD
operation: Freq
keyword: #pfreq=noraman
keyword: PBEPBE/SDD
title: #p freq=noraman PBEPBE/SDD
converged: YES YES NO NO
title: Mulliken charges:
elementType: O O C C C C C C C C C C C C C C C C H H H H H H H H H H H H H H H H H H H H
charge: -0.284592 -0.267028 -0.553418 0.468366 -0.361186 -0.129634 0.309218 0.223989 -0.345703 -0.613371 0.136128 -0.408271 -0.391930 -0.697692 -0.249780 -0.238026 -0.526611 -0.531463 0.219955 0.192498 0.221132 0.196477 0.200663 0.190132 0.246974 0.266141 0.273413 0.215013 0.208741 0.215217 0.225436 0.226416 0.231569 0.217208 0.228638 0.221450 0.243237 0.220694
chargesum: 0.00000
title: Mulliken charges with hydrogens summed into heavy atoms:
elementType: O O C C C C C C C C C C C C C C C C
charge: -0.284592 -0.267028 -0.140965 0.468366 0.056423 -0.129634 0.309218 0.223989 0.045093 -0.366398 0.136128 -0.142131 -0.118517 -0.058721 -0.024344 -0.011610 0.150804 0.153919
polarizability: 2.45931312e+02 -8.49340550e+00 2.07958622e+02 -2.45137440e+01 6.47780010e+00 1.12879869e+02
1716.lowfreq: -9.3278 -0.0005 -0.0004 0.0003 4.6467 8.7714 19.7849 45.3046 65.4330
frequency: 19.5362 45.2816 65.4313 71.1045 84.4293 104.7922 106.4594 134.5931 152.9140 175.0788 185.7574 202.3690 225.6958 232.5736 250.4820 267.2925 270.4619 310.0561 357.3775 381.2265 429.3180 436.2632 469.2394 480.2461 527.2736 563.7879 612.6030 636.2909 639.4683 677.0364 707.7383 732.4152 772.2578 783.1668 799.3008 806.2531 855.7647 893.5299 899.0587 910.0931 927.2528 939.6227 962.2158 975.2019 996.9180 1013.1575 1029.4189 1064.7445 1068.7085 1093.9036 1097.8952 1107.3518 1109.9133 1114.1023 1147.4829 1160.4237 1161.5258 1170.1463 1207.8244 1217.7275 1252.3091 1256.7575 1278.0891 1285.4234 1290.6820 1324.9104 1348.5145 1357.2697 1382.1021 1387.8906 1420.3580 1424.4460 1435.0512 1442.1872 1455.8456 1456.2894 1461.9056 1465.6707 1467.5953 1473.8069 1475.4238 1476.4411 1477.4353 1487.4785 1513.3827 1583.3744 1596.8799 1630.6700 2954.1645 2958.4102 2962.7823 2971.8623 2973.2373 2979.2258 3006.0354 3034.2962 3040.3556 3045.2975 3062.6549 3070.3117 3072.3950 3108.7478 3123.4416 3127.2448 3145.0815 3145.6267 3162.1665 3174.3646
redmass: 3.3214 4.1834 1.7466 2.8210 2.9061 3.2076 2.4988 3.7240 1.0450 3.9075 3.2794 1.8781 1.2128 3.1827 2.3867 2.5311 2.6377 3.5798 4.9338 3.2907 3.8440 3.9621 5.5308 5.1339 4.2550 4.9764 4.5204 3.4175 4.3823 5.3797 4.4427 1.0896 2.7208 1.4681 1.4645 2.5666 1.6080 1.6738 1.9494 2.9490 1.8827 4.4618 6.5014 1.3663 1.3164 4.1644 2.1990 2.9329 2.5820 2.3663 2.1610 2.2056 1.2866 1.2621 1.3867 1.6927 1.5133 1.0966 1.4711 1.5784 1.8056 1.3421 1.6185 1.5718 1.2037 1.3850 1.5843 2.8116 3.7150 1.2137 2.1764 4.2943 1.4051 1.3370 2.1501 1.0971 1.1140 1.0506 1.0747 1.0633 1.1186 1.0436 1.0724 1.0843 3.9281 7.9363 6.1604 7.3170 1.0313 1.0330 1.0586 1.0543 1.0428 1.0657 1.0972 1.0991 1.1037 1.1037 1.0995 1.0998 1.1003 1.1009 1.0994 1.0856 1.0901 1.0902 1.0957 1.0975
irintensity: 0.1509 0.0456 0.5129 2.7109 4.2818 3.8564 0.7198 2.5717 0.1048 0.5065 3.4511 0.9213 0.2736 0.4241 0.3873 3.0108 1.7067 7.6860 3.9924 0.7538 7.1802 0.5827 0.2555 1.0003 2.8568 0.9640 0.9653 3.7041 16.5372 7.5028 14.0302 9.3642 10.9012 72.1677 1.7720 1.9749 21.1062 1.0984 5.3948 6.0295 14.1195 9.1295 44.0479 3.3851 0.2833 10.7436 17.3756 68.0064 4.6106 4.6267 41.6716 23.8201 1.4739 0.1198 1.0672 39.2552 15.7853 0.8177 6.3421 81.4963 1.9107 2.8995 27.9532 2.8697 1.3087 3.5143 3.8497 130.4619 5.3423 11.7326 13.2846 13.6539 6.4072 12.6718 41.4374 10.4077 5.8538 13.7114 0.8671 1.2104 17.9230 12.6430 4.2264 16.3417 14.2417 6.1454 69.8366 10.7542 66.2239 63.4827 22.2495 8.3107 41.2133 78.5753 6.9628 14.2870 43.3847 47.4210 6.4972 82.1887 73.8148 33.1911 23.8472 6.3496 13.0162 16.8121 18.5348 18.6036
temp: 298.150 k
press: 1.00000 atm
elementType: 8 8 6 6 6 6 6 6 6 6 6 6 6 6 6 6 6 6 1 1 1 1 1 1 1 1 1 1 1 1 1 1 1 1 1 1 1 1
symmnumber: 1
zpe: 836581.2 jmol-1
zpe.correction: 0.318637 hartree
zpe.thermalcorrener: 0.337124 hartree
zpe.thermalcorrenthalpy: 0.338068 hartree
zpe.thermalcorrgfe: 0.271104 hartree
zpe.sumelectzpe: -770.789712 hartree
zpe.sumelectthermal: -770.771225 hartree
zpe.sumelectthermalent: -770.770281 hartree
zpe.sumelectthermalfe: -770.837245 hartree
dipole: -1.0619 1.2359 1.8400
dipole: 2.4577
quadrupole: -104.6322 -91.3761 -109.7745
quadrupole: -3.6902 -3.6251 -1.4249
quadrupole: -2.7046 10.5515 -7.8469 -3.6902 -3.6251 -1.4249
hfenergy: -771.1083489 hartree
pointgroup: C01 [X(C16H20O2)]
dipole: -0.371989 0.5915827 0.6683124 debye
polarizability: 244.1314266|-14.1788817|210.6824739|-22.0912611|-0.8363746|111.9559021 unknown
InChI: InChI=1S/C16H20O2/c1-4-5-8-12-11-15(17-2)13-9-6-7-10-14(13)16(12)18-3/h6-7,9-11H,4-5,8H2,1-3H3
charge 0 multiplicity 1
38 atoms
O  -0.814134 -2.354376 0.29024
O  1.828066 2.640478 -0.105127
C  -2.409616 0.053424 0.692389
C  -0.916101 0.086465 0.41542
C  -3.250225 0.378913 -0.574697
C  -0.172079 -1.082746 0.214923
C  1.225891 -1.035691 -0.133401
C  1.887968 0.245128 -0.229767
C  -4.769817 0.382005 -0.295709
C  -0.252526 1.354663 0.303257
C  1.109226 1.438003 0.002867
C  1.982119 -2.22281 -0.404208
C  3.278299 0.297539 -0.562487
C  -5.606083 0.713179 -1.550727
C  3.339053 -2.146888 -0.730035
C  3.995065 -0.87875 -0.802616
C  -0.691142 -3.000905 1.612306
C  1.091631 3.887566 0.09816
H  -2.705617 -0.946606 1.055828
H  -2.662461 0.786914 1.484808
H  -3.015044 -0.367248 -1.358804
H  -2.945168 1.36615 -0.97794
H  -5.068697 -0.610146 0.099616
H  -4.994142 1.116927 0.505107
H  -0.847666 2.258555 0.469162
H  1.463598 -3.186366 -0.378713
H  3.761317 1.27617 -0.629791
H  -5.420851 -0.02362 -2.354661
H  -5.346347 1.713022 -1.947055
H  -6.68937 0.707858 -1.329558
H  3.903413 -3.062097 -0.941467
H  5.059266 -0.831137 -1.058594
H  -1.201458 -3.972635 1.520726
H  -1.179987 -2.39074 2.39746
H  0.370966 -3.155811 1.884754
H  0.279036 3.998978 -0.646222
H  1.833487 4.688065 -0.038816
H  0.667137 3.941871 1.119774
