program: Gaussian 09
title: 000183588
version: EM64L-G09RevD.01
frameworkgroup: C1[X(C15H11ClF3NO3)]
method: RPBEPBE
basis: SDD
operation: Freq
keyword: #p
keyword: freq=noraman
keyword: PBEPBE/SDD
title: #p freq=noraman PBEPBE/SDD
converged: YES YES NO NO
title: Mulliken charges:
elementType: Cl F F F O O O N C C C C C C C C C C C C C C C H H H H H H H H H H H
charge: 0.028664 -0.164578 -0.152534 -0.185950 -0.310080 -0.155772 -0.219077 0.029626 -0.415125 -0.416940 -0.496069 -0.499177 0.180857 0.092517 0.014177 0.095944 0.036825 -0.397764 0.193767 0.514680 -0.330016 -0.321122 0.153253 0.214575 0.220850 0.214393 0.222229 0.257885 0.242935 0.250751 0.240326 0.344708 0.290271 0.224971
chargesum: 0.00000
title: Mulliken charges with hydrogens summed into heavy atoms:
elementType: Cl F F F O O O N C C C C C C C C C C C C C C C
charge: 0.028664 -0.164578 -0.152534 -0.185950 -0.310080 -0.155772 -0.219077 0.029626 0.020300 0.019682 0.004750 -0.008100 0.180857 0.092517 0.014177 0.095944 0.036825 -0.053057 0.193767 0.514680 -0.039745 -0.321122 0.378224
polarizability: 3.65575104e+02 4.63774765e+01 2.25858215e+02 8.13642068e-01 -2.89240943e+00 9.38847491e+01
1716.lowfreq: -4.2867 -0.0019 -0.0008 0.0016 2.3764 4.4208 16.2395 28.0904 42.8300
frequency: 16.0727 28.0670 42.8121 46.3071 57.4388 77.5641 97.6816 103.5296 135.4465 156.9464 165.9017 176.0376 195.5766 215.9846 262.6708 264.4794 280.4350 297.5023 315.8121 323.1138 395.8668 401.9212 439.7855 445.6528 453.9372 473.7394 504.1753 505.7410 520.7779 563.5327 573.6456 621.8926 642.7472 647.4696 654.9278 671.6474 686.2940 713.1660 731.9369 746.2613 775.1593 807.0792 814.7978 844.9826 855.7428 863.3896 896.2952 897.0421 932.4736 959.6142 973.4495 990.1169 1035.6159 1041.1952 1079.8275 1081.9407 1093.1271 1128.7242 1146.9859 1161.6803 1171.1327 1218.5198 1231.8323 1233.8864 1261.5467 1266.7014 1287.6292 1297.6647 1316.6228 1333.1680 1339.2548 1349.8275 1356.2701 1383.5591 1399.3772 1445.1989 1452.8676 1470.7840 1472.5858 1486.0216 1567.3435 1585.3054 1633.6314 1662.9199 1716.9531 2975.5787 2980.9240 2988.6000 2992.2410 3034.1822 3042.5257 3056.2667 3058.8841 3062.5806 3176.9424 3191.2987
redmass: 7.3606 9.0240 8.0038 9.6096 11.0473 5.9991 5.7269 3.3886 4.8142 7.4927 13.7072 12.5618 8.0443 12.3518 4.1933 3.4198 3.3498 5.0494 5.2638 8.0548 5.7056 8.9849 4.3443 6.2178 3.0506 7.3969 5.1038 5.0938 9.1376 7.4066 5.1173 6.6517 6.6270 8.2745 6.5708 8.0767 5.7079 5.4370 3.2147 9.2275 7.3798 7.0397 1.6974 2.4357 1.5629 2.7068 1.5188 1.5402 8.0681 2.6951 5.1549 5.7202 5.0439 5.8603 2.0294 3.4899 1.9638 1.1564 4.5955 1.7963 1.7553 3.8434 1.3515 1.5845 1.3766 1.4313 1.3788 1.6356 1.5039 1.4002 1.4720 6.3737 1.8411 6.8064 4.4533 1.1094 1.0810 1.0929 1.0889 3.1612 10.2917 7.0385 8.6555 11.0859 12.6523 1.0648 1.0664 1.0661 1.0607 1.0943 1.0933 1.0981 1.0883 1.1037 1.0926 1.0933
irintensity: 1.4191 0.4170 0.6414 0.1359 3.2619 0.4417 0.9859 2.6796 0.5631 0.3072 0.8065 1.2008 1.4007 0.6414 2.2248 8.0017 3.0737 2.1293 0.9631 2.2740 2.4803 10.8770 0.9344 4.4495 5.5611 4.6742 2.4653 5.9716 19.6479 3.7006 10.0801 8.5845 2.5587 4.8317 14.8306 15.0896 65.9682 9.2571 0.4886 1.3212 131.9081 39.0213 3.1637 19.2662 18.3014 16.2647 16.3228 11.4564 205.7820 2.9238 50.9824 37.1293 307.2025 275.2771 0.7972 0.9301 5.6786 2.3712 20.5975 121.6872 65.4676 47.6875 7.6644 8.8806 50.2383 22.3061 25.5322 67.6998 27.7412 0.9611 3.3756 3.9321 1.3756 26.8142 15.6708 6.0519 31.5777 13.0043 8.6448 236.8833 14.1261 11.2512 33.1883 244.9208 334.9676 10.0085 6.3792 34.2853 32.9289 17.3106 6.7214 58.3746 25.8614 45.1255 10.1092 0.5725
temp: 298.150 k
press: 1.00000 atm
elementType: 17 9 9 9 8 8 8 7 6 6 6 6 6 6 6 6 6 6 6 6 6 6 6 1 1 1 1 1 1 1 1 1 1 1
symmnumber: 1
zpe: 613291.7 jmol-1
zpe.correction: 0.233590 hartree
zpe.thermalcorrener: 0.254091 hartree
zpe.thermalcorrenthalpy: 0.255035 hartree
zpe.thermalcorrgfe: 0.181518 hartree
zpe.sumelectzpe: -1616.531811 hartree
zpe.sumelectthermal: -1616.511311 hartree
zpe.sumelectthermalent: -1616.510367 hartree
zpe.sumelectthermalfe: -1616.583883 hartree
dipole: 5.3381 -3.6369 -1.1819
dipole: 6.5665
quadrupole: -121.9541 -154.3863 -135.6371
quadrupole: 2.7637 4.5363 -2.9686
quadrupole: 15.3718 -17.0605 1.6887 2.7637 4.5363 -2.9686
hfenergy: -1616.7654018 hartree
pointgroup: C01 [X(C15H11Cl1F3N1O3)]
dipole: 2.2252945 -1.2576688 0.3749919 debye
polarizability: 356.7607749|57.6429245|198.1159968|-12.9430102|-60.2811976|130.4412958 unknown
InChI: InChI=1S/C15H11ClF3NO3/c16-9-5-10(17)11(6-12(9)22-15(18)19)20-13-7-3-1-2-4-8(7)14(21)23-13/h5-6,15H,1-4H2
charge 0 multiplicity 1
34 atoms
Cl -5.374996 -1.519364 0.611801
F  -0.594579 -3.065986 1.809846
F  -4.560729 2.337542 -1.993712
F  -2.814809 2.885146 -0.637022
O  1.001732 1.157158 -0.57417
O  2.175709 2.886372 -1.680423
O  -3.926176 0.836491 -0.445525
N  0.633268 -0.841799 0.774935
C  5.166573 -0.284657 1.333949
C  5.698396 0.353906 0.023892
C  3.738172 -0.865754 1.157221
C  4.813978 1.543034 -0.438884
C  2.881893 0.094349 0.383387
C  3.361816 1.173851 -0.320551
C  1.417813 0.046783 0.250418
C  2.232073 1.88673 -0.953995
C  -0.76178 -0.914882 0.681114
C  -1.621951 0.077459 0.11291
C  -1.385279 -2.071014 1.233622
C  -3.015499 -0.110138 0.088057
C  -2.773605 -2.264689 1.225118
C  -3.591512 -1.280294 0.645286
C  -3.43506 1.803025 -1.34583
H  5.152209 0.484119 2.131733
H  5.851404 -1.084291 1.670015
H  5.719024 -0.416352 -0.772272
H  6.738341 0.699404 0.166866
H  3.266649 -1.092916 2.131107
H  3.773358 -1.832752 0.615257
H  5.05141 1.837155 -1.478671
H  5.018244 2.43971 0.181387
H  -1.168498 0.995719 -0.268108
H  -3.202149 -3.17077 1.659176
H  -2.711841 1.417808 -2.087537
