program: Gaussian 09
title: 000183620
version: EM64L-G09RevD.01
frameworkgroup: C1[X(C21H28O3)]
method: RPBEPBE
basis: SDD
operation: Freq
keyword: #pfreq=noraman
keyword: PBEPBE/SDD
title: #p freq=noraman PBEPBE/SDD
converged: YES YES NO NO
title: Mulliken charges:
elementType: O O O C C C C C C C C C C C C C C C C C C C C C H H H H H H H H H H H H H H H H H H H H H H H H H H H H
charge: -0.280312 -0.295754 -0.198503 0.279127 0.305527 -0.590998 -0.602534 -0.205771 -0.095740 -0.358003 -0.363777 0.339915 0.317025 -0.350140 -0.349837 -0.423510 -0.404426 -0.700104 -0.699617 -0.251785 -0.246646 -0.525857 0.235923 -0.757809 0.204061 0.222587 0.239195 0.218910 0.199567 0.226395 0.219701 0.197535 0.193131 0.198091 0.196511 0.198511 0.272857 0.254829 0.214394 0.215728 0.212412 0.217023 0.212942 0.211316 0.228502 0.227600 0.217062 0.230722 0.234620 0.259616 0.250857 0.248932
chargesum: 0.00000
title: Mulliken charges with hydrogens summed into heavy atoms:
elementType: O O O C C C C C C C C C C C C C C C C C C C C C
charge: -0.280312 -0.295754 -0.198503 0.279127 0.305527 -0.164351 -0.144429 -0.205771 -0.095740 0.067959 0.053459 0.339915 0.317025 0.041082 0.045185 -0.150653 -0.149598 -0.057570 -0.058336 -0.023283 -0.019046 0.156548 0.235923 0.001595
polarizability: 3.05370010e+02 -1.22860184e+01 2.71211986e+02 2.54301360e+00 1.61829615e+01 1.69803989e+02
1716.lowfreq: -70.8735 -9.4100 -8.5102 -5.6711 -0.0011 -0.0008 -0.0003 22.5431 24.9768
frequency: -70.8676 22.3973 24.9328 27.6000 36.6234 45.9926 54.2488 62.8283 70.8384 74.4896 93.8131 106.7589 112.7265 118.4964 136.6273 142.6002 149.9885 183.5511 216.8635 220.2533 221.3057 234.9932 241.6236 263.9500 299.3593 309.3401 334.4512 337.7429 365.2549 375.5512 407.9910 436.1500 462.5554 479.5819 491.1624 511.8326 557.3744 566.0840 600.1995 627.1367 652.3513 654.4826 687.9998 724.2695 728.0700 730.4999 750.9927 778.7216 779.3642 800.0839 813.9317 833.6153 878.5261 886.7119 893.3494 902.5710 917.2880 933.4203 935.6035 968.2277 976.9092 992.2018 993.5163 1009.5802 1012.0133 1028.6440 1041.6050 1054.5231 1065.8429 1066.7073 1089.7471 1093.0635 1103.2825 1107.2234 1108.6711 1122.2680 1149.2445 1153.9466 1170.3253 1180.9937 1206.3538 1213.6758 1248.3975 1255.4358 1267.5543 1270.9145 1277.1370 1287.4687 1287.7192 1292.4694 1318.1663 1318.8092 1337.9336 1345.5466 1348.3672 1381.6394 1386.8908 1389.6851 1392.6911 1404.5082 1431.9851 1436.8992 1442.1793 1452.6487 1456.2464 1457.1170 1460.4162 1466.4671 1467.9568 1472.8391 1474.0263 1474.3179 1476.2325 1477.5656 1485.2920 1487.7938 1496.0784 1502.2008 1572.0447 1595.2775 1631.6603 1668.1843 2956.7070 2960.2109 2961.6896 2971.8355 2972.8440 2973.9971 2975.7400 2996.5467 3003.8178 3004.4661 3008.1892 3011.7234 3031.8372 3033.7643 3043.2315 3059.0639 3065.0460 3070.7448 3071.6284 3072.4282 3072.7285 3096.3964 3113.4490 3129.3358 3140.3294 3144.9846 3159.9454 3169.5509
redmass: 1.0331 3.8872 3.9540 3.9156 7.1054 4.4889 4.2512 1.5291 2.2920 1.8452 2.9798 3.9980 2.3999 2.5022 3.5099 3.2741 1.0799 4.5561 2.1613 1.3693 1.1736 3.6006 3.9343 4.2351 4.0098 4.1235 4.4581 5.0310 2.4373 3.0586 3.5643 4.3091 4.2671 4.5630 4.4834 4.9041 3.4095 4.4015 4.9009 3.9641 5.3122 5.7555 4.4338 4.6311 1.1415 1.1363 2.1944 1.2006 1.5281 1.9240 2.6674 4.1073 2.4406 1.7453 1.8141 1.7866 4.0950 1.6601 1.5573 1.3780 5.0943 1.8698 1.4087 4.1023 4.5086 2.1247 1.6153 3.6383 2.5351 2.5797 2.0562 1.8911 2.0501 2.1753 1.2544 1.7815 1.4320 2.7443 1.1306 1.8265 1.5020 1.4444 1.3406 1.2904 1.8373 1.3204 1.2649 1.0859 1.8198 1.3104 1.4157 1.3840 2.7367 1.5720 1.5526 1.2241 1.2125 1.2151 7.4434 2.9061 1.4661 7.4846 2.0908 1.0630 1.0555 1.0469 1.1161 1.0700 1.0669 1.0767 1.0522 1.0580 1.0430 1.0717 1.0764 1.0836 1.5733 1.7766 7.7074 7.4903 7.5670 11.3330 1.0315 1.0587 1.0589 1.0565 1.0403 1.0406 1.0572 1.0638 1.0982 1.0953 1.0367 1.0600 1.1018 1.0997 1.1035 1.1029 1.1017 1.1004 1.1007 1.1000 1.0998 1.0967 1.1010 1.0853 1.1015 1.0891 1.0947 1.0998
irintensity: 0.8584 0.1222 0.0335 0.0790 1.2014 0.2386 1.9243 0.0828 1.5433 1.0048 2.9450 2.6327 0.0283 0.0871 2.1648 0.8909 0.0039 1.7763 0.0512 0.1762 0.0528 0.9761 0.8718 1.3459 2.1682 0.5963 7.8226 3.5158 1.8233 1.2103 3.0208 1.8615 0.8159 11.1174 4.8176 7.7980 2.0433 5.3244 2.8522 0.8788 0.1415 2.7492 14.6543 1.2682 7.2395 7.0369 37.1343 0.3601 63.8096 2.9950 0.5560 22.6213 1.6667 2.3049 2.6389 5.7853 18.1504 6.1509 8.9691 2.1430 65.5196 73.2343 11.5773 7.0183 49.9783 5.9103 7.0310 0.3894 3.6864 1.8957 37.4854 7.8474 26.0973 27.6157 0.0047 58.2932 1.0143 398.0397 19.0605 15.3108 1.2249 8.6588 7.0802 0.6205 19.1869 6.1368 5.8857 1.6885 7.6108 4.0095 3.0393 0.7048 78.5731 0.3529 1.2089 55.0063 11.7250 11.8623 0.7444 4.2454 4.0940 1.0004 7.5292 12.1502 11.1232 13.8433 2.8847 0.6834 0.2916 1.3144 17.1509 1.0292 12.1169 7.0239 11.5726 19.5576 0.4172 14.9594 2.7642 14.4169 1.3211 156.3146 58.9241 31.9453 16.6306 23.3922 30.4728 44.9751 36.5185 44.2604 5.0897 15.0613 2.8993 33.4065 10.8518 5.8484 39.3719 27.8512 1.2112 138.9787 32.7242 15.0658 111.8202 4.9020 30.1102 3.0160 7.2732 10.1986 18.5478 29.7798
temp: 298.150 k
press: 1.00000 atm
elementType: 8 8 8 6 6 6 6 6 6 6 6 6 6 6 6 6 6 6 6 6 6 6 6 6 1 1 1 1 1 1 1 1 1 1 1 1 1 1 1 1 1 1 1 1 1 1 1 1 1 1 1 1
symmnumber: 1
zpe: 1149519.7 jmol-1
zpe.correction: 0.437829 hartree
zpe.thermalcorrener: 0.463673 hartree
zpe.thermalcorrenthalpy: 0.464617 hartree
zpe.thermalcorrgfe: 0.379029 hartree
zpe.sumelectzpe: -1040.898590 hartree
zpe.sumelectthermal: -1040.872746 hartree
zpe.sumelectthermalent: -1040.871802 hartree
zpe.sumelectthermalfe: -1040.957390 hartree
dipole: -0.1748 1.0661 -2.8704
dipole: 3.0670
quadrupole: -132.4912 -128.3093 -152.4527
quadrupole: 2.3631 0.7540 7.9676
quadrupole: 5.2599 9.4417 -14.7016 2.3631 0.7540 7.9676
hfenergy: -1041.3364191 hartree
pointgroup: C01 [X(C21H28O3)]
dipole: -0.132676 0.3878497 -1.134884 debye
polarizability: 308.0129977|-7.2080389|269.0808209|-0.5568564|14.7972545|169.2921661 unknown
InChI: InChI=1S/C21H28O3/c1-5-7-11-16-18(12-8-6-2)21(24-15(3)22)19-14-10-9-13-17(19)20(16)23-4/h9-10,13-14H,5-8,11-12H2,1-4H3
charge 0 multiplicity 1
52 atoms
O  0.161489 -3.216877 -0.570597
O  1.09861 2.321115 0.121442
O  0.798876 2.324588 2.450954
C  -0.715559 -0.961244 -0.263756
C  -0.485147 0.450764 -0.044948
C  -2.123764 -1.535245 -0.295267
C  -1.643646 1.431753 0.051706
C  0.387046 -1.821063 -0.394081
C  0.835665 0.906766 0.018167
C  -2.627171 -1.926584 1.123773
C  -2.013069 2.052254 -1.325047
C  1.744009 -1.360274 -0.287364
C  1.977705 0.05268 -0.096262
C  -4.066028 -2.487969 1.10955
C  -3.200666 3.036028 -1.232876
C  2.865605 -2.249771 -0.348186
C  3.325212 0.53338 -0.017296
C  -4.561678 -2.891054 2.515244
C  -3.564415 3.6627 -2.596152
C  4.169117 -1.757095 -0.257907
C  4.400329 -0.353773 -0.102715
C  0.226564 -3.658413 -1.978977
C  1.077557 2.934499 1.402177
C  1.423309 4.402463 1.276192
H  -2.831298 -0.816195 -0.749387
H  -2.14017 -2.445651 -0.920508
H  -1.393858 2.247442 0.753261
H  -2.533363 0.929888 0.472032
H  -2.578265 -1.044962 1.794841
H  -1.934858 -2.680744 1.545245
H  -1.125734 2.574252 -1.733841
H  -2.258677 1.241958 -2.041774
H  -4.752418 -1.731313 0.676013
H  -4.106427 -3.368138 0.435539
H  -2.9534 3.839701 -0.509102
H  -4.083666 2.507254 -0.818897
H  2.675746 -3.323959 -0.43458
H  3.498104 1.606372 0.107058
H  -5.590842 -3.293673 2.482387
H  -3.908142 -3.666682 2.956334
H  -4.559531 -2.022983 3.201015
H  -4.41483 4.363261 -2.506157
H  -2.707532 4.222603 -3.015683
H  -3.845088 2.882976 -3.329097
H  5.020236 -2.445596 -0.297192
H  5.42729 0.022424 -0.040738
H  -0.563198 -3.169021 -2.582582
H  1.214255 -3.431179 -2.424298
H  0.06341 -4.747072 -1.959272
H  1.724986 4.657347 0.250551
H  2.23413 4.647184 1.98314
H  0.546292 5.009479 1.563117
