program: Gaussian 09
title: 000183584
version: EM64L-G09RevD.01
frameworkgroup: C1[X(C17H18ClF3N2O3)]
method: RPBEPBE
basis: SDD
operation: Freq
keyword: #p
keyword: freq=noraman
keyword: PBEPBE/SDD
title: #p freq=noraman PBEPBE/SDD
converged: YES YES NO NO
title: Mulliken charges:
elementType: Cl F F F O O O N N C C C C C C C C C C C C C C C C C H H H H H H H H H H H H H H H H H H
charge: 0.012998 -0.217813 -0.186671 -0.156420 -0.228424 -0.262253 -0.218834 -0.158151 -0.473480 -0.408935 -0.419562 -0.510304 -0.482919 0.136698 0.076350 0.037801 0.108278 0.353696 -0.609298 -0.623910 -0.455191 0.107347 0.528235 -0.320980 -0.336186 0.151100 0.213302 0.220152 0.199493 0.218456 0.265413 0.217436 0.241438 0.247823 0.373928 0.224378 0.281260 0.246895 0.245177 0.257570 0.236047 0.359081 0.284675 0.224301
chargesum: 0.00000
title: Mulliken charges with hydrogens summed into heavy atoms:
elementType: Cl F F F O O O N N C C C C C C C C C C C C C C C C C
charge: 0.012998 -0.217813 -0.186671 -0.156420 -0.228424 -0.262253 -0.218834 -0.158151 -0.099553 0.024519 -0.001613 -0.027455 0.006343 0.136698 0.076350 0.037801 0.108278 0.353696 0.143235 0.114885 -0.096110 0.107347 0.528235 -0.036305 -0.336186 0.375401
polarizability: 3.21916445e+02 1.48648361e+01 2.44258491e+02 2.36600914e-01 2.59331486e+00 1.38236108e+02
1716.lowfreq: -5.7736 -0.0011 0.0006 0.0007 0.9438 6.6988 10.0396 27.1180 35.9949
frequency: 9.6608 27.0650 35.9766 47.9987 51.5947 56.5687 68.1568 75.1065 83.4661 93.5704 107.0213 133.3741 145.2870 152.7530 156.3420 168.6468 175.2677 191.0803 193.4674 222.7745 262.2920 271.4198 280.4014 297.4920 301.0063 323.1692 328.0479 352.4568 369.8184 394.4763 401.5503 409.7260 442.7221 451.4647 478.4620 491.8236 507.7153 527.5483 559.9683 589.4465 601.7256 636.8975 649.1052 661.2430 693.0890 702.5618 721.8223 740.5181 756.9157 765.0116 799.5104 826.2867 842.3192 846.3590 886.7070 898.5573 908.1962 914.2714 932.4300 965.4771 980.7882 1011.5151 1031.7763 1036.0415 1042.3543 1049.1403 1082.8878 1094.9575 1108.6026 1117.1492 1130.8562 1132.4038 1147.3967 1166.1392 1176.4453 1179.3378 1230.0382 1232.7595 1237.6310 1245.1255 1270.8187 1289.5111 1300.5833 1312.1815 1331.7491 1341.4355 1346.9838 1353.4866 1369.1375 1383.9206 1392.9448 1415.4725 1434.8026 1445.1549 1452.1905 1467.8739 1468.8972 1470.9002 1472.6313 1473.1791 1488.9837 1501.8507 1512.8165 1564.5382 1573.3172 1601.4954 1621.4088 1639.3125 2945.5020 2967.9212 2977.6754 2981.4924 2990.3943 2990.9161 3021.6756 3040.1481 3048.0927 3048.2109 3057.1983 3061.9082 3072.5033 3106.3944 3124.6474 3171.5040 3190.5686 3428.4899
redmass: 6.5472 7.1491 9.6921 8.8106 7.8754 6.6445 3.6546 6.8267 5.6738 3.1823 2.8068 6.0462 5.7212 1.2509 1.6641 2.8603 7.9677 3.2953 5.3635 3.9766 6.4036 3.1452 3.6308 2.6569 7.4805 5.6570 7.2336 4.0430 4.2015 5.0907 7.2298 3.6968 6.3726 3.8776 5.7971 5.8775 2.7653 4.5641 7.3929 5.7165 6.1500 7.4011 9.3671 4.5911 4.3192 4.0030 5.6167 3.4785 3.8791 1.6135 4.2392 1.6417 1.4532 4.4710 2.9469 1.5992 2.7978 1.5139 6.7124 3.6385 3.8805 2.9500 4.1556 4.7231 3.7496 1.4443 1.9102 1.2282 1.9221 4.0775 2.4405 1.1867 1.3974 2.0404 1.5176 2.9434 1.3767 3.8270 2.4287 1.4180 1.2504 1.2181 2.1074 1.7917 1.3973 1.5647 1.6996 1.5840 2.9850 6.6282 9.6852 1.1524 1.2072 1.1085 1.0821 1.1019 1.0581 1.7137 1.2271 1.2058 1.0523 1.2262 2.9100 6.9350 5.8807 4.0422 6.0808 7.4572 1.0664 1.0374 1.0649 1.0382 1.0629 1.0627 1.0908 1.0954 1.0990 1.0993 1.1040 1.0883 1.0972 1.0983 1.0998 1.0926 1.0933 1.0788
irintensity: 0.7348 1.5373 1.5023 1.9017 0.1328 4.2963 1.5331 1.2545 0.9295 0.8153 3.7702 2.2746 1.0319 0.0805 1.2044 1.4893 1.2146 3.0510 1.5318 2.8156 2.0418 1.0857 13.0372 1.2736 4.8544 1.4535 6.5810 9.1938 10.1764 1.7759 8.1524 5.2066 10.3406 5.2848 8.7450 9.7326 2.7158 4.0322 7.5259 0.9815 15.6376 1.4733 2.4218 5.1837 11.4841 2.0782 9.7724 12.6905 40.6835 28.0391 25.1343 5.6619 16.8853 39.3036 4.3834 0.9292 13.4267 21.4190 222.3684 12.0302 5.1894 67.0821 75.4994 514.4934 46.1965 4.9451 1.4158 0.8034 1.5915 36.6018 18.4542 8.2487 6.7642 154.1176 16.4149 46.4225 8.9165 26.5586 181.2138 12.5648 32.1346 28.2507 38.2185 57.6868 2.5612 1.0742 0.2041 0.1821 32.3856 117.4760 90.1815 37.9987 10.8411 3.3988 20.9401 7.1571 14.5388 101.6673 27.4568 27.4503 12.3858 38.8659 662.3840 180.7003 150.5552 11.4993 91.0320 38.9945 22.0278 45.7933 37.1026 67.0955 20.0188 20.2572 18.7994 18.6627 31.2603 46.7967 50.1283 27.2744 20.4432 11.1790 0.9149 32.7459 0.8045 187.6532
temp: 298.150 k
press: 1.00000 atm
elementType: 17 9 9 9 8 8 8 7 7 6 6 6 6 6 6 6 6 6 6 6 6 6 6 6 6 6 1 1 1 1 1 1 1 1 1 1 1 1 1 1 1 1 1 1
symmnumber: 1
zpe: 860960.5 jmol-1
zpe.correction: 0.327923 hartree
zpe.thermalcorrener: 0.354033 hartree
zpe.thermalcorrenthalpy: 0.354977 hartree
zpe.thermalcorrgfe: 0.268671 hartree
zpe.sumelectzpe: -1751.436283 hartree
zpe.sumelectthermal: -1751.410172 hartree
zpe.sumelectthermalent: -1751.409228 hartree
zpe.sumelectthermalfe: -1751.495535 hartree
dipole: 7.1899 -3.9973 -2.3968
dipole: 8.5684
quadrupole: -160.0359 -154.0628 -162.9910
quadrupole: 7.2885 -14.9526 6.6821
quadrupole: -1.0060 4.9671 -3.9611 7.2885 -14.9526 6.6821
hfenergy: -1751.7642056 hartree
pointgroup: C01 [X(C17H18Cl1F3N2O3)]
dipole: -2.7393138 -1.964122 0.0506862 debye
polarizability: 322.596503|-7.4096963|218.0973443|-11.7411332|44.9072786|163.717197 unknown
InChI: InChI=1S/C17H18ClF3N2O3/c1-23(2)16(25)10-6-4-3-5-9(10)15(24)22-13-8-14(26-17(20)21)11(18)7-12(13)19/h7-8,17,22H,3-6H2,1-2H3
charge 0 multiplicity 1
44 atoms
Cl 5.619357 -1.522916 -0.854213
F  0.555904 -2.698629 -1.004385
F  3.784391 2.5851 1.892837
F  5.497639 3.004119 0.453531
O  -2.759166 -0.044947 -2.380707
O  -0.173559 1.726756 1.209573
O  4.563155 0.957473 0.403836
N  -2.670209 -2.002859 -1.104458
N  -0.247928 -0.33541 0.115674
C  -5.16678 1.575876 0.947799
C  -4.346266 1.577513 2.252909
C  -4.757559 0.379403 0.064318
C  -2.844065 1.726998 1.939819
C  -3.244177 0.177476 -0.024364
C  -2.362768 0.802751 0.822224
C  -2.85705 -0.62543 -1.25389
C  -0.858815 0.773942 0.717711
C  1.135102 -0.536089 -0.072032
C  -2.421508 -2.826051 -2.305968
C  -2.945743 -2.74389 0.141296
C  2.149825 0.385068 0.303994
C  1.558349 -1.756549 -0.656808
C  3.504827 0.081529 0.051299
C  2.894454 -2.081692 -0.895936
C  3.8838 -1.145479 -0.541124
C  4.271431 2.324714 0.56792
H  -6.251207 1.528799 1.159296
H  -4.981014 2.519013 0.398369
H  -4.527417 0.631175 2.80194
H  -4.668529 2.401162 2.916301
H  -5.146097 0.508131 -0.964231
H  -5.223179 -0.553235 0.451897
H  -2.234252 1.542967 2.843833
H  -2.613153 2.770204 1.647902
H  -0.853181 -1.074187 -0.26319
H  -3.289734 -3.481969 -2.509939
H  -2.269246 -2.152632 -3.162807
H  -1.522519 -3.448827 -2.159568
H  -2.109166 -3.431821 0.362959
H  -3.061865 -2.046456 0.985483
H  -3.871332 -3.344676 0.043811
H  1.843567 1.297093 0.821207
H  3.156592 -3.038862 -1.352264
H  3.539691 2.730045 -0.153852
