program: Gaussian 09
title: 000183546
version: EM64L-G09RevD.01
frameworkgroup: C1[X(C18H24O3)]
method: RPBEPBE
basis: SDD
operation: Freq
keyword: #pfreq=noraman
keyword: PBEPBE/SDD
title: #p freq=noraman PBEPBE/SDD
converged: YES YES NO NO
title: Mulliken charges:
elementType: O O O C C C C C C C C C C C C C C C C C C H H H H H H H H H H H H H H H H H H H H H H H H
charge: -0.280373 -0.294047 -0.285661 -0.039552 -0.440128 -0.469655 -0.440234 -0.434887 0.295056 0.242483 0.113924 0.273793 -0.099351 -0.557387 0.240059 -0.241556 -0.320389 -0.700247 -0.720451 -0.843552 -0.524524 0.239979 0.217582 0.247139 0.249499 0.197498 0.212330 0.217112 0.212275 0.229016 0.272646 0.226481 0.242225 0.226421 0.213161 0.241575 0.201274 0.230862 0.238444 0.220017 0.275719 0.231426 0.250080 0.207595 0.226321
chargesum: 0.00000
title: Mulliken charges with hydrogens summed into heavy atoms:
elementType: O O O C C C C C C C C C C C C C C C C C C
charge: -0.280373 -0.294047 -0.285661 0.200427 0.024593 -0.022658 -0.010792 0.006405 0.295056 0.242483 0.113924 0.273793 -0.099351 -0.284741 0.240059 -0.015074 -0.078164 -0.019089 -0.049871 -0.116390 0.159472
polarizability: 2.99669900e+02 -1.35359592e+01 2.15863782e+02 -6.70064952e+00 -3.01456296e+00 1.36367546e+02
1716.lowfreq: -9.6809 -4.3368 -0.0006 -0.0003 0.0003 11.3983 35.7749 37.7087 48.0647
frequency: 35.7035 37.5288 48.0381 67.7949 77.0723 83.0728 100.3616 105.4771 141.8381 155.8777 176.3692 190.1412 194.4638 217.6668 222.3894 235.5205 245.6032 251.5560 276.9221 314.2010 325.5619 340.8518 357.4478 389.1758 417.5583 430.8553 458.9297 478.7671 515.3833 536.8478 550.2920 556.9373 571.7979 610.2061 653.6885 675.5345 687.3081 722.8470 737.3177 760.0474 775.6574 796.7313 815.6014 841.6073 852.1629 854.1909 868.9272 893.1493 905.3063 916.3535 938.7863 940.2347 944.9148 957.3192 961.7267 995.1068 1016.2655 1020.8428 1042.2825 1055.8253 1059.6642 1093.2547 1095.1052 1109.9584 1115.2658 1151.9381 1158.2194 1162.5827 1168.9013 1193.1114 1202.7714 1218.1304 1219.4944 1224.4008 1252.5076 1267.6791 1286.6237 1299.3009 1305.1851 1317.0533 1323.0708 1339.9976 1360.5851 1370.9168 1375.6882 1389.4737 1392.2078 1407.5244 1442.1980 1450.4952 1451.2283 1452.0512 1455.6054 1458.2523 1459.0292 1469.3145 1470.4938 1479.1522 1481.6502 1482.6066 1483.6238 1488.9428 1559.9994 1604.7231 1639.7742 2963.8628 2976.6558 2981.5635 2992.9078 2993.4736 2995.2958 3003.0652 3007.1746 3020.0565 3050.3224 3056.3339 3066.2592 3069.1139 3079.3138 3080.5996 3087.7734 3090.6816 3093.0045 3103.7753 3113.1986 3113.8865 3122.8506 3151.7976 3180.8398
redmass: 3.4502 3.3571 3.4107 2.5706 2.6890 3.4940 2.2832 3.3802 1.0431 1.3745 3.2821 2.4081 1.0332 2.9148 2.6286 3.0285 1.7444 2.3265 2.9877 3.2277 2.8740 2.9497 3.4238 3.7144 3.5974 3.0869 5.0311 4.9358 3.9198 4.1573 2.8818 3.4424 2.8366 5.3042 4.0035 3.0504 3.2422 4.7879 2.5337 4.0395 2.5120 1.9297 3.0015 1.9673 2.0261 2.8617 2.7130 2.6720 2.4316 1.5749 2.5133 1.7966 1.5306 1.3217 4.1304 1.3090 1.4953 5.4866 1.5096 2.1572 1.9044 1.9631 3.0547 1.2646 1.7073 1.3834 1.5217 1.5322 2.0100 2.0658 1.6537 1.7607 1.4512 2.2394 2.5063 1.2377 1.3373 1.9724 1.2576 1.9641 1.5146 1.7330 3.2648 1.3053 2.3887 1.2327 1.2879 1.7655 1.6726 1.1735 1.0966 1.3345 1.1967 1.1357 1.0499 1.1512 1.0871 1.3895 1.0630 1.1261 1.1190 1.0491 9.5517 7.5554 7.6188 1.0338 1.0397 1.0346 1.0355 1.0648 1.0674 1.0622 1.0679 1.0778 1.0966 1.0997 1.0989 1.1017 1.1012 1.0996 1.1027 1.1008 1.0993 1.1006 1.1023 1.0968 1.0853 1.0988 1.0908
irintensity: 0.5622 0.3814 1.3734 2.9078 1.7096 1.0118 1.2217 0.3677 0.7882 1.0677 1.5597 2.3804 0.0480 1.2889 0.9552 1.7967 1.1365 3.9294 1.5617 8.6388 3.3550 2.2177 3.8572 0.2683 1.3552 2.0133 1.8414 7.4288 4.1173 0.1137 1.9251 3.1059 0.7666 3.0089 0.6065 15.0786 2.4737 2.0179 16.0274 16.5183 18.8374 3.2711 7.3303 31.0454 5.2315 24.2082 1.7330 4.8130 2.5382 0.8879 16.7249 1.6833 11.7739 0.6915 93.9390 0.2662 2.2601 79.2005 2.0844 176.8086 17.0278 13.1535 53.3818 19.0892 114.0644 8.3256 27.9957 8.4493 32.9337 112.3410 17.4147 8.9287 8.9136 10.3671 65.8176 5.7086 12.8544 149.8460 1.1109 52.4417 8.8320 7.2694 26.8873 29.6916 9.7876 18.7985 29.3154 8.3867 24.7566 21.0123 16.0482 10.0851 7.9249 8.3413 1.9608 4.9465 13.1552 67.0236 19.3952 59.5650 2.0622 11.6261 18.8896 194.6882 32.2272 88.3423 33.8653 18.1162 27.5804 17.2672 26.9121 38.2766 42.4966 34.8751 19.6789 20.4451 34.4577 27.3518 36.8571 9.7352 64.9127 24.0401 28.0314 29.4714 31.3133 1.4715 1.3518 26.7960 4.1955
temp: 298.150 k
press: 1.00000 atm
elementType: 8 8 8 6 6 6 6 6 6 6 6 6 6 6 6 6 6 6 6 6 6 1 1 1 1 1 1 1 1 1 1 1 1 1 1 1 1 1 1 1 1 1 1 1 1
symmnumber: 1
zpe: 992490.8 jmol-1
zpe.correction: 0.378020 hartree
zpe.thermalcorrener: 0.399500 hartree
zpe.thermalcorrenthalpy: 0.400444 hartree
zpe.thermalcorrgfe: 0.327721 hartree
zpe.sumelectzpe: -924.361579 hartree
zpe.sumelectthermal: -924.340098 hartree
zpe.sumelectthermalent: -924.339154 hartree
zpe.sumelectthermalfe: -924.411878 hartree
dipole: -0.2784 -1.4114 -0.7902
dipole: 1.6414
quadrupole: -106.2662 -120.9475 -128.2072
quadrupole: 3.6240 2.5314 -7.0729
quadrupole: 12.2075 -2.4739 -9.7336 3.6240 2.5314 -7.0729
hfenergy: -924.7395987 hartree
pointgroup: C01 [X(C18H24O3)]
dipole: -0.1294984 -0.549847 -0.3129156 debye
polarizability: 298.5031558|-14.7222811|216.3317136|-13.0701242|-1.3905791|137.0663586 unknown
InChI: InChI=1S/C18H24O3/c1-12-14-9-10-18(2,3)21-15(14)11-16(17(12)19-4)20-13-7-5-6-8-13/h9-11,13H,5-8H2,1-4H3
charge 0 multiplicity 1
45 atoms
O  -2.265491 0.204933 0.570652
O  2.197392 -1.5180 -0.373999
O  -1.304737 2.805864 0.512504
C  -2.790632 -1.179873 0.753858
C  -2.978574 -1.903564 -0.617001
C  -4.208518 -1.007184 1.33204
C  -4.516675 -1.926725 -0.889852
C  -5.110957 -0.872412 0.082251
C  -0.904234 0.371025 0.287171
C  3.678135 -1.343776 -0.110095
C  1.360877 -0.416005 -0.127217
C  1.849263 0.918893 -0.185633
C  -0.435171 1.723338 0.235454
C  -0.000288 -0.697866 0.092906
C  0.933346 2.000629 0.000634
C  4.126176 0.046963 -0.53788
C  3.263764 1.103971 -0.520669
C  3.906144 -1.556573 1.406267
C  4.334848 -2.452389 -0.947933
C  1.413433 3.440405 -0.039747
C  -2.4167 3.002328 -0.438253
H  -2.106043 -1.709915 1.443024
H  -2.551376 -2.922741 -0.595445
H  -2.438136 -1.343823 -1.400393
H  -4.254571 -0.148904 2.022843
H  -4.479015 -1.921048 1.896586
H  -4.93025 -2.925026 -0.650679
H  -4.756684 -1.715335 -1.946567
H  -5.00868 0.144222 -0.342319
H  -6.179647 -1.043789 0.29988
H  -0.318072 -1.742447 0.109279
H  5.177589 0.166438 -0.824446
H  3.615406 2.105864 -0.788879
H  3.558147 -2.560947 1.707937
H  4.980467 -1.464497 1.650164
H  3.356055 -0.797629 1.989584
H  5.428427 -2.454055 -0.788856
H  3.935007 -3.438221 -0.654396
H  4.132216 -2.296324 -2.020794
H  1.828463 3.701198 -1.032481
H  0.577917 4.121908 0.178051
H  2.209965 3.618811 0.706123
H  -3.106793 2.141353 -0.416584
H  -2.030705 3.152864 -1.466092
H  -2.932689 3.913061 -0.095703
