program: Gaussian 09
title: 000183549
version: EM64L-G09RevD.01
frameworkgroup: C1[X(C20H30O4)]
method: RPBEPBE
basis: SDD
operation: Freq
keyword: #pfreq=noraman
keyword: PBEPBE/SDD
title: #p freq=noraman PBEPBE/SDD
converged: YES YES NO NO
title: Mulliken charges:
elementType: O O O O C C C C C C C C C C C C C C C C C C C C H H H H H H H H H H H H H H H H H H H H H H H H H H H H H H
charge: -0.432283 -0.447324 -0.219285 -0.209721 -0.137590 0.382358 0.266482 -0.041198 -0.524727 -0.497312 -0.554853 -0.492042 0.359592 -0.837112 -0.440330 -0.461689 -0.782703 -0.376879 -0.528973 -0.545229 0.378247 -0.428315 -0.492783 0.175542 0.201863 0.185593 0.221705 0.200270 0.203325 0.202111 0.217364 0.225781 0.211107 0.209630 0.228157 0.226983 0.226309 0.220626 0.203289 0.220053 0.217087 0.229110 0.219097 0.216446 0.217957 0.237623 0.241040 0.232051 0.218114 0.342749 0.345394 0.241386 0.241727 0.284178
chargesum: 0.00000
title: Mulliken charges with hydrogens summed into heavy atoms:
elementType: O O O O C C C C C C C C C C C C C C C C C C C C
charge: -0.089534 -0.101930 -0.219285 -0.209721 0.064273 0.382358 0.266482 0.144395 -0.102752 -0.091875 -0.111709 -0.071305 0.359592 -0.155663 -0.016415 -0.024550 -0.118050 -0.158922 -0.050310 -0.095063 0.378247 0.054798 -0.208604 0.175542
polarizability: 2.63058016e+02 -5.34559164e+00 2.08679390e+02 2.02819674e+01 1.06829497e+00 1.92112185e+02
1716.lowfreq: -14.3764 -9.0246 -6.5209 -0.0004 0.0002 0.0005 19.2306 31.5839 35.4963
frequency: 18.2065 31.4576 35.4623 62.1572 68.8174 80.1167 90.1466 96.3071 122.5720 142.8908 158.7456 167.5117 186.1278 197.4622 214.0467 218.8405 224.1371 253.9671 260.6048 271.0421 285.0405 289.9190 299.8770 321.4797 334.5829 340.2718 348.1015 369.7173 380.4670 418.1387 427.0790 430.8397 446.2158 479.5024 493.5867 502.8317 532.7602 556.4093 575.9443 611.3779 638.4130 673.4802 676.0509 696.0409 708.3068 715.8971 751.2641 797.6841 807.4561 830.9878 850.0758 860.7574 872.7104 882.2282 889.7355 906.9344 909.9887 922.0221 933.6971 942.7025 952.0847 956.4992 960.2207 972.6363 980.7550 995.3620 1006.6438 1017.9156 1038.6926 1041.1037 1058.1589 1061.1828 1084.1818 1089.0439 1111.3759 1114.3478 1114.9117 1130.4381 1139.9915 1152.0431 1157.1301 1160.4549 1163.9138 1183.5325 1194.1472 1201.4196 1210.8293 1225.7751 1231.3656 1240.9270 1259.8260 1286.0020 1291.9059 1302.9548 1304.1382 1313.1562 1318.1520 1327.9571 1329.6700 1334.5921 1339.5529 1346.6973 1349.1738 1350.5999 1360.0256 1361.6181 1378.6555 1379.7832 1388.9615 1397.9111 1439.1220 1446.6303 1452.7187 1457.2831 1464.9556 1473.1523 1473.5783 1475.6223 1481.2281 1484.3260 1489.7635 1495.5450 1499.5419 1644.0807 1664.5306 1705.9493 2933.0063 2939.5787 2945.4549 2954.7041 2956.5053 2976.2171 2979.7054 2985.7070 2986.8726 2992.5059 2994.0360 2995.0503 2996.0412 2997.6757 3005.2266 3017.2762 3028.5483 3041.1973 3048.7500 3049.5399 3063.1047 3068.0670 3068.6561 3077.6739 3087.2537 3087.7173 3094.8588 3224.2425 3533.8206 3582.7904
redmass: 5.5908 4.3030 5.7377 4.1942 3.4106 3.1362 4.1278 2.9581 3.3369 4.3217 3.7007 3.4421 1.2877 2.8910 2.8070 1.8249 1.7940 1.5069 1.8647 2.6485 3.4641 2.0254 2.3300 2.4268 2.7600 2.9791 2.4517 2.5924 3.2010 3.1528 2.4177 3.0764 1.2408 3.5101 4.2130 3.1323 2.3959 3.1728 2.8999 2.7611 5.5423 3.6575 5.1070 3.0757 3.3259 2.1064 1.7639 1.8158 6.2530 2.1034 1.9388 1.7448 1.5391 1.7583 2.3107 2.0619 2.6567 2.6165 2.0386 2.3604 1.7452 4.2402 1.6407 2.6984 2.3187 2.1666 1.8014 2.0073 1.9754 2.0351 2.2058 3.1731 2.3525 4.0381 1.4434 1.9832 1.5728 1.9445 1.7745 1.9186 1.5447 2.0828 1.3702 1.5959 2.0951 1.5566 1.5242 1.5972 1.5335 1.5677 1.4136 1.2361 1.3724 1.4208 1.2376 1.3603 1.5239 1.5207 1.3824 1.3275 1.3168 1.5435 1.4438 1.3224 1.4253 1.2096 1.2526 1.5517 1.2178 1.2052 1.0806 1.0973 1.0854 1.0797 1.0670 1.0784 1.0595 1.0793 1.0770 1.0701 1.0608 1.0542 1.0687 6.8316 7.3501 12.2151 1.0812 1.0801 1.0652 1.0593 1.0597 1.0548 1.0426 1.0411 1.0712 1.0718 1.0808 1.0636 1.0627 1.0597 1.0778 1.0980 1.1023 1.1013 1.1028 1.1019 1.0985 1.0976 1.1056 1.0985 1.0969 1.0921 1.0970 1.0984 1.0656 1.0663
irintensity: 4.4034 0.0103 1.7185 1.0432 2.2315 18.1388 3.3728 0.5287 1.0836 2.0656 11.1142 0.7270 3.6289 8.0515 5.2084 26.9317 10.4902 97.0251 0.1674 8.8631 2.0857 6.3412 2.5132 21.6325 1.6356 0.3544 0.5385 8.2580 2.5515 3.9282 13.5615 7.5263 148.8224 9.5065 8.9550 7.7326 2.8560 5.4002 1.7420 2.2455 0.4479 2.6791 0.7016 17.0826 14.5469 5.8300 1.1079 4.7721 63.5259 0.7978 34.9329 6.5557 27.6376 18.5040 14.0216 3.9371 29.3934 27.7007 15.4664 6.8194 33.3069 22.4692 10.2251 51.8150 34.3200 1.2610 1.1485 5.6148 5.0600 4.7581 10.5915 12.1599 3.8752 84.3259 3.1009 4.5607 4.3530 9.3012 11.1625 7.1226 24.9281 5.4807 8.2133 3.5351 10.4668 0.5915 7.9235 5.5550 5.7005 4.1608 3.7651 0.2346 4.8836 1.3456 3.6803 9.7040 22.2195 0.5380 0.1473 0.5731 0.1978 1.6526 0.6701 20.2582 0.5634 10.1206 7.2411 2.4592 14.4012 30.1182 7.0494 17.2300 11.2943 3.9667 3.0780 11.7358 8.1932 6.3967 11.5794 8.3133 3.5413 8.0274 24.9727 49.8375 7.2932 496.3881 5.5643 36.2211 34.9728 29.6104 24.7952 15.8508 44.2028 11.9462 2.7250 2.7118 29.8739 1.6107 67.3246 31.2002 71.8947 41.0480 44.0150 35.6490 21.3904 36.4429 56.6485 27.8399 15.6155 37.9040 42.0305 12.4420 43.6015 2.7323 4.3442 3.5340
temp: 298.150 k
press: 1.00000 atm
elementType: 8 8 8 8 6 6 6 6 6 6 6 6 6 6 6 6 6 6 6 6 6 6 6 6 1 1 1 1 1 1 1 1 1 1 1 1 1 1 1 1 1 1 1 1 1 1 1 1 1 1 1 1 1 1
symmnumber: 1
zpe: 1215043.6 jmol-1
zpe.correction: 0.462786 hartree
zpe.thermalcorrener: 0.487534 hartree
zpe.thermalcorrenthalpy: 0.488478 hartree
zpe.thermalcorrgfe: 0.408476 hartree
zpe.sumelectzpe: -1079.096635 hartree
zpe.sumelectthermal: -1079.071887 hartree
zpe.sumelectthermalent: -1079.070943 hartree
zpe.sumelectthermalfe: -1079.150945 hartree
dipole: 4.5084 0.9224 0.0919
dipole: 4.6027
quadrupole: -223.0381 -144.1816 -144.7129
quadrupole: -4.6159 -9.7756 9.0820
quadrupole: -52.3939 26.4626 25.9313 -4.6159 -9.7756 9.0820
hfenergy: -1079.5594211 hartree
pointgroup: C01 [X(C20H30O4)]
dipole: 1.7728929 -0.3645921 -0.0550486 debye
polarizability: 262.6393252|5.3283423|208.6662448|-21.0075088|1.0532231|192.5440199 unknown
InChI: InChI=1S/C20H30O4/c1-14-6-9-20(13-22)16(11-21)4-3-5-17(20)19(14,2)8-7-15-10-18(23)24-12-15/h4,10,14,17,21-22H,3,5-9,11-13H2,1-2H3
charge 0 multiplicity 1
54 atoms
O  4.770427 -0.517711 1.320329
O  4.068061 1.613107 -2.40468
O  -5.602002 1.22915 -0.84174
O  -6.778383 0.175711 0.895465
C  1.009463 0.057967 0.426593
C  0.133836 -1.25897 0.470254
C  2.548733 -0.124783 0.11074
C  0.376342 -2.053889 -0.872156
C  2.674794 -0.959772 -1.200949
C  1.883988 -2.280991 -1.146367
C  0.817843 0.998104 1.646207
C  -1.38796 -0.88143 0.592558
C  3.170421 1.281616 -0.078468
C  0.436029 -2.148661 1.7092
C  3.33717 -0.852119 1.266107
C  1.376498 2.410584 1.35255
C  -0.379295 -3.400432 -0.974854
C  2.637677 2.386275 0.518688
C  -1.958755 0.112761 -0.442354
C  4.40232 1.459122 -0.964545
C  -3.441523 0.343881 -0.315074
C  -4.192667 1.245206 -1.283186
C  -4.334195 -0.144738 0.593198
C  -5.698163 0.372518 0.315816
H  0.640552 0.618879 -0.461625
H  0.011163 -1.402428 -1.697849
H  3.743553 -1.171474 -1.405949
H  2.27633 -0.35653 -2.043406
H  1.993544 -2.808411 -2.114569
H  2.307881 -2.96519 -0.384518
H  1.324315 0.583516 2.537855
H  -0.249982 1.084301 1.916558
H  -1.575857 -0.481358 1.607816
H  -1.972095 -1.819609 0.533387
H  0.416721 -1.552706 2.639665
H  -0.330407 -2.938225 1.814899
H  1.414669 -2.651089 1.650582
H  3.340304 -1.942577 1.115653
H  2.873277 -0.636761 2.247854
H  1.555428 2.960213 2.298821
H  0.618615 3.012097 0.804582
H  -0.029191 -4.121152 -0.213175
H  -1.472558 -3.291824 -0.862022
H  -0.198108 -3.857831 -1.965577
H  3.120043 3.35958 0.340579
H  -1.746443 -0.23659 -1.474331
H  -1.44773 1.094877 -0.359898
H  5.123629 0.632165 -0.824198
H  4.899028 2.412817 -0.715046
H  4.852489 0.442833 1.55475
H  3.928717 0.716212 -2.798557
H  -3.832308 2.290963 -1.258992
H  -4.150406 0.875939 -2.325348
H  -4.141833 -0.819246 1.425822
