program: Gaussian 09
title: 000183499
version: EM64L-G09RevD.01
frameworkgroup: C1[X(C23H30O3)]
method: RPBEPBE
basis: SDD
operation: Freq
keyword: #pfreq=noraman
keyword: PBEPBE/SDD
title: #p freq=noraman PBEPBE/SDD
converged: YES YES NO NO
title: Mulliken charges:
elementType: O O O C C C C C C C C C C C C C C C C C C C C C C C H H H H H H H H H H H H H H H H H H H H H H H H H H H H H H
charge: -0.258871 -0.244549 -0.312870 -0.148903 -0.452472 -0.061016 -0.374115 -0.024057 -0.725817 -0.729444 0.204072 -0.721649 -0.721441 -0.485485 0.497572 -0.516682 -0.405529 0.336865 -0.199444 -0.394253 0.345033 -0.357897 -0.384172 -0.206451 -0.193516 -0.251046 0.235632 0.206198 0.225196 0.226129 0.193315 0.217466 0.186039 0.212429 0.234298 0.210551 0.208110 0.226916 0.214410 0.214648 0.209828 0.211168 0.223097 0.205963 0.217865 0.220737 0.237755 0.275613 0.268023 0.232557 0.261227 0.264026 0.257614 0.228510 0.230267 0.230553
chargesum: 0.00000
title: Mulliken charges with hydrogens summed into heavy atoms:
elementType: O O O C C C C C C C C C C C C C C C C C C C C C C C
charge: -0.258871 -0.244549 -0.312870 0.086729 -0.021077 0.165113 0.036665 0.161982 -0.068539 -0.080009 0.204072 -0.086004 -0.074516 -0.026993 0.497572 -0.241069 -0.137507 0.336865 0.033113 -0.133026 0.345033 -0.093872 -0.126559 0.022059 0.036751 -0.020494
polarizability: 2.82617459e+02 2.43171635e+00 2.41233825e+02 3.67950607e+01 1.22925030e+01 2.43120265e+02
1716.lowfreq: -18.2716 -14.5516 -8.4170 -6.3027 -0.0007 -0.0006 -0.0002 7.5178 10.4776
frequency: -14.1448 -4.9936 9.0598 18.4175 30.5458 35.8018 50.5905 56.3658 65.4258 75.1487 85.9483 113.2610 119.7113 152.7722 176.0297 192.6085 204.6015 211.2427 215.5790 219.7355 225.9533 235.2992 250.2816 268.1429 296.4421 320.2476 336.2981 352.2805 376.5601 383.7610 393.2127 409.9628 412.9457 436.5176 448.8450 450.9485 479.0570 524.2117 528.4714 562.1125 578.1353 610.1548 624.0661 653.8821 690.0250 696.5851 702.8136 723.9147 752.0128 764.5987 771.4823 798.8849 810.9738 818.2345 835.5246 853.7013 883.7234 899.7079 911.8106 913.1826 916.5108 918.6040 927.5810 930.2706 946.0418 950.3310 958.4743 966.4933 968.4648 983.2711 986.3388 987.2972 988.2643 999.2670 1013.9677 1019.7232 1055.9144 1077.5001 1086.4046 1091.3461 1100.8990 1129.5097 1138.9897 1156.4608 1167.8214 1169.4128 1173.1220 1175.2195 1176.7607 1185.4052 1199.9390 1214.6335 1228.4535 1249.2621 1251.3594 1272.9833 1282.8410 1302.0835 1304.3654 1311.4678 1314.8494 1318.3406 1324.9884 1329.7546 1343.7840 1352.5501 1376.2248 1380.3854 1381.6998 1388.6928 1393.7932 1398.9154 1433.7151 1441.8270 1450.9201 1461.3110 1463.3179 1466.5596 1468.4009 1470.5897 1472.8720 1473.2714 1477.7041 1480.5747 1483.3259 1487.7260 1489.6742 1593.4112 1593.7640 1606.6557 1611.6908 1627.5332 2947.1936 2956.5766 2963.8894 2969.3774 2970.1347 2973.8575 2983.8246 2989.5271 3003.0136 3010.7833 3038.5211 3056.1516 3057.4373 3061.5845 3063.5523 3066.6565 3070.2236 3070.9598 3073.2040 3077.7896 3111.1679 3130.5390 3139.8731 3140.3423 3146.6258 3155.8744 3160.5592 3164.6042 3173.7684 3174.4612
redmass: 2.7948 3.9192 4.3596 4.5101 4.4193 4.2049 2.6058 4.0905 4.7516 5.9967 3.4232 4.2063 2.0689 3.5924 5.0025 1.2525 2.0030 1.5039 1.3091 3.5067 1.3864 1.7890 3.5707 2.6554 4.9275 3.4627 3.5359 3.4015 2.4390 2.4068 2.6698 2.8502 2.5721 2.9999 2.5694 2.8857 3.3745 4.6249 3.7627 7.6167 5.3246 5.9953 4.6375 3.0164 2.4960 3.0805 3.4846 3.9021 3.6898 1.7694 1.4887 2.1653 2.6355 2.4497 1.2903 2.4231 2.6767 1.5862 1.5183 1.1860 1.4419 1.2308 1.8454 2.6109 2.0361 1.4242 1.5038 1.6748 1.3629 1.5826 4.1499 1.4346 3.4847 2.1323 2.7700 2.0909 1.8630 1.5163 1.6220 2.6912 2.0405 2.2500 1.9315 2.3313 1.1335 1.7993 1.1484 1.1447 1.7925 2.9253 2.6092 1.6310 1.1796 3.5125 1.4084 1.2884 1.2456 1.3163 1.2070 1.3062 1.3936 1.3851 1.4047 1.3771 1.2928 1.5163 1.2140 7.4114 1.2104 8.4953 1.2142 1.2063 2.6716 2.3516 1.0733 1.1471 1.0668 1.0497 1.0707 2.2469 1.0540 1.0567 2.4544 1.0544 1.0554 1.0490 1.0472 6.4973 6.2783 6.4367 6.5625 9.6987 1.0815 1.0599 1.0355 1.0366 1.0365 1.0364 1.0818 1.0598 1.0863 1.0987 1.0578 1.1003 1.1014 1.0992 1.0997 1.0990 1.0988 1.0986 1.0994 1.0988 1.1082 1.0850 1.0891 1.0871 1.0920 1.0930 1.0930 1.0964 1.0989 1.1004
irintensity: 0.1037 0.0048 0.1764 0.3216 0.6646 0.3256 0.1582 0.3124 0.3307 1.8370 0.3712 0.2728 0.0723 2.0993 0.7383 0.3391 1.0255 0.7104 0.1909 0.8732 0.0730 0.3220 3.1983 2.5655 0.5723 2.1081 4.4224 1.4410 0.5526 0.5096 5.1707 0.1555 1.9745 2.7274 6.9362 11.8628 18.9620 1.4090 5.6356 0.3369 8.3435 1.4066 0.6459 1.4731 40.6383 4.6306 8.7325 20.1241 28.2378 79.5776 6.1375 38.8794 1.0670 30.4368 2.1534 1.2223 66.3827 3.7882 7.6736 2.8017 2.0587 5.7953 10.2684 33.9639 100.6534 11.3271 2.3118 24.8856 0.1709 1.2071 0.9484 1.0493 1.0389 2.9890 22.5087 12.5345 14.1515 12.5197 13.4992 65.2499 28.8022 0.4221 6.6738 3.2879 25.9314 22.4715 36.5000 6.2872 4.5631 114.7681 186.0402 22.8388 0.2320 257.9904 5.9689 2.3655 3.5740 0.8094 5.9571 0.7201 0.6296 3.1189 0.2669 1.8207 13.8820 0.5930 18.1844 8.4565 17.8185 2.6325 15.6875 18.3935 51.5883 13.6695 2.0989 21.0060 4.0835 2.0220 2.1545 174.4964 4.9390 4.5073 8.7435 7.0892 3.1645 21.6572 18.4046 134.3060 51.5189 19.2178 2.3195 131.1087 19.7925 20.2928 40.4041 19.3730 28.2919 27.5063 0.7348 32.2383 22.2703 12.8117 33.1092 5.7281 28.2735 7.9473 78.3702 75.2307 69.6539 51.5550 52.1041 49.6960 4.8132 2.2327 10.6541 8.5356 6.5507 26.2594 3.5132 14.5474 9.1960 6.2511
temp: 298.150 k
press: 1.00000 atm
elementType: 8 8 8 6 6 6 6 6 6 6 6 6 6 6 6 6 6 6 6 6 6 6 6 6 6 6 1 1 1 1 1 1 1 1 1 1 1 1 1 1 1 1 1 1 1 1 1 1 1 1 1 1 1 1 1 1
symmnumber: 1
zpe: 1239581.0 jmol-1
zpe.correction: 0.472131 hartree
zpe.thermalcorrener: 0.497876 hartree
zpe.thermalcorrenthalpy: 0.498820 hartree
zpe.thermalcorrgfe: 0.413667 hartree
zpe.sumelectzpe: -1118.165728 hartree
zpe.sumelectthermal: -1118.139984 hartree
zpe.sumelectthermalent: -1118.139039 hartree
zpe.sumelectthermalfe: -1118.224192 hartree
dipole: -0.9763 -1.2404 -1.4509
dipole: 2.1440
quadrupole: -155.4041 -149.4639 -153.4927
quadrupole: 6.3148 -3.4604 0.9146
quadrupole: -2.6172 3.3230 -0.7058 6.3148 -3.4604 0.9146
hfenergy: -1118.6378595 hartree
pointgroup: C01 [X(C23H30O3)]
dipole: 0.1850828 0.4531769 0.6869527 debye
polarizability: 247.8673448|39.0399025|267.4265983|11.800175|16.9130242|251.6776055 unknown
InChI: InChI=1S/C23H30O3/c1-17(2)13-14-22(18(3)4)23(24)25-16-19-9-8-12-21(15-19)26-20-10-6-5-7-11-20/h5-12,15,17-18,22H,13-14,16H2,1-4H3
charge 0 multiplicity 1
56 atoms
O  -1.247743 -1.43992 1.204231
O  -2.017341 -3.100637 -0.241787
O  2.868247 1.694338 -0.824013
C  -3.544513 -1.276428 0.478671
C  -3.330607 0.150819 -0.108062
C  -4.114943 -1.266798 1.938468
C  -2.711016 0.14619 -1.524537
C  -2.605957 1.547336 -2.185108
C  -4.240162 -2.705186 2.496328
C  -5.484976 -0.550545 2.004203
C  -2.233227 -2.05625 0.416029
C  -2.106512 1.410034 -3.643432
C  -1.682577 2.500809 -1.387418
C  0.134722 -2.034386 1.13303
C  0.921881 -1.421981 -0.006249
C  1.571062 -0.17613 0.178233
C  0.986514 -2.070228 -1.266119
C  2.274036 0.409841 -0.897533
C  1.689867 -1.467545 -2.33383
C  2.337763 -0.226027 -2.157307
C  3.441204 2.173253 0.382938
C  4.168471 1.342418 1.267407
C  3.336426 3.563319 0.607362
C  4.785168 1.922204 2.398575
C  3.962528 4.128641 1.739765
C  4.684669 3.312201 2.642093
H  -4.24919 -1.835062 -0.169772
H  -4.311572 0.6626 -0.147454
H  -2.687899 0.719933 0.589261
H  -3.392276 -0.709167 2.567946
H  -3.31737 -0.513488 -2.180239
H  -1.695121 -0.298502 -1.489792
H  -3.625054 1.992045 -2.2082
H  -4.93054 -3.310001 1.877661
H  -3.264947 -3.224322 2.516721
H  -4.635087 -2.687839 3.528791
H  -6.213945 -1.030456 1.322408
H  -5.414058 0.517206 1.732948
H  -5.896738 -0.608103 3.028908
H  -1.091883 0.966398 -3.663404
H  -2.055068 2.394602 -4.144822
H  -2.772939 0.757287 -4.238301
H  -0.667844 2.067358 -1.292345
H  -1.587651 3.476273 -1.900378
H  -2.065935 2.693831 -0.369132
H  0.560233 -1.781875 2.116953
H  0.03542 -3.127051 1.017455
H  1.507866 0.339118 1.14289
H  0.465566 -3.022818 -1.406314
H  1.735671 -1.965705 -3.308078
H  2.886381 0.259761 -2.96972
H  4.262382 0.270094 1.069013
H  2.773768 4.174685 -0.104446
H  5.353603 1.284504 3.084724
H  3.88328 5.20677 1.917238
H  5.167156 3.753788 3.520339
