program: Gaussian 09
title: 000015632
version: EM64L-G09RevD.01
frameworkgroup: C1[X(C12H12N4O7)]
method: RPBEPBE
basis: SDD
operation: Freq
keyword: #p
keyword: freq=noraman
keyword: PBEPBE/SDD
title: #p freq=noraman PBEPBE/SDD
converged: YES YES NO NO
title: Mulliken charges:
elementType: O O O O O O O N N N N C C C C C C C C C C C C H H H H H H H H H H H H
charge: -0.186740 -0.268046 -0.187240 -0.221604 -0.231065 -0.214013 -0.198672 -0.190573 -0.207934 0.075895 0.050654 -0.468919 0.190570 0.316885 -0.494909 0.301388 -0.338641 0.360797 -0.220674 -0.308831 0.273684 -0.299907 -0.673284 0.283358 0.282814 0.287470 0.286585 0.251504 0.237930 0.236857 0.295263 0.296378 0.219975 0.229004 0.234040
chargesum: 0.00000
title: Mulliken charges with hydrogens summed into heavy atoms:
elementType: O O O O O O O N N N N C C C C C C C C C C C C
charge: -0.186740 -0.268046 -0.187240 -0.221604 -0.231065 -0.214013 -0.198672 -0.190573 -0.207934 0.075895 0.050654 0.097253 0.190570 0.316885 0.079146 0.301388 -0.087137 0.360797 0.254114 -0.013568 0.273684 -0.003529 0.009735
polarizability: 4.05573813e+02 -3.96851294e+01 1.26035081e+02 1.52485840e+01 1.61867940e+01 1.71699973e+02
1716.lowfreq: -3.3660 0.0003 0.0007 0.0007 3.8311 6.9234 12.4156 20.8449 22.2506
frequency: 12.2183 20.8284 22.1049 39.3366 45.9715 48.2576 60.2490 75.7404 102.1245 135.6323 137.0662 148.3344 161.5028 180.1942 189.1125 215.7883 239.9041 256.6617 262.7341 301.6744 312.1229 318.7394 363.3449 374.4240 401.8590 443.0813 464.7983 525.5896 540.2684 563.0950 565.4517 588.2802 618.1884 631.3903 653.4636 658.7698 680.3865 710.2436 732.7686 741.0218 797.5560 799.8079 816.2070 827.6363 872.4495 905.6049 911.2014 916.0988 919.1285 945.3591 979.4627 993.2160 1020.9496 1021.8454 1071.4945 1113.4659 1130.3144 1133.7307 1138.3914 1160.9555 1161.1643 1176.6770 1189.4983 1200.0755 1223.2370 1252.8961 1262.8850 1313.6472 1318.3824 1336.1282 1343.6446 1358.6596 1368.1759 1373.6012 1384.1932 1401.9368 1422.1784 1447.3670 1465.4141 1473.0913 1485.6343 1496.9275 1552.1437 1583.0833 1646.9714 1667.6550 1725.5907 2997.3455 2999.3494 3018.7036 3034.3325 3059.0930 3062.7001 3078.4420 3094.3277 3099.0826 3110.7845 3241.2398 3260.1771
redmass: 5.3111 6.6852 3.8148 8.4850 6.6965 6.4384 3.8857 7.2697 7.5095 5.9412 5.2418 3.0994 5.5982 4.6410 6.4050 5.7852 2.5306 1.4430 3.9023 7.4244 2.9317 8.4442 4.0391 6.3626 8.5098 9.2944 7.8885 8.5230 3.5237 5.6533 3.4907 9.0153 5.4092 6.4062 4.5008 5.6372 8.8076 9.1730 10.8817 6.4664 4.4452 1.1202 4.8352 1.3003 3.1529 5.0750 1.4085 1.4564 7.3120 4.8764 3.9774 1.9230 1.2772 2.3470 4.9767 2.2667 3.1742 3.9009 1.7754 1.1516 3.5268 4.1144 6.5113 3.7880 1.7712 1.1329 6.0373 1.7001 1.4908 1.4194 10.1167 1.3876 3.8980 4.3960 2.7443 1.2664 1.1142 1.1068 1.0400 1.0662 1.0651 8.3743 6.1365 6.9133 11.1933 12.0682 11.9229 1.0359 1.0576 1.0583 1.0594 1.1050 1.0883 1.1064 1.0984 1.1027 1.1037 1.0953 1.1045
irintensity: 0.0914 1.7728 1.9661 1.7816 2.8229 1.6063 1.6550 0.6758 2.6365 11.8125 0.2196 3.8922 4.5926 9.2012 0.7374 1.0863 7.4803 0.6836 7.3235 13.4952 5.8995 8.7307 7.0593 2.5578 0.6235 14.1080 3.5546 10.6642 2.3614 0.5991 1.1764 24.4571 8.7099 9.1058 0.4849 18.1043 10.8902 25.1196 47.8732 28.0665 3.1739 5.6069 10.3587 57.7783 7.3764 35.9520 26.8899 21.6708 9.7853 0.3567 118.4457 3.1215 49.3315 79.7226 32.0461 9.2411 27.9139 169.6868 52.2605 0.6308 72.4443 68.7320 278.9797 392.9522 419.7188 0.9841 393.1847 22.9039 108.7578 51.2142 90.2046 15.6731 308.7954 349.0694 9.5397 15.0745 62.8754 87.9674 14.6822 5.4879 16.1487 56.4970 62.4796 94.5689 301.2675 554.9353 254.3346 13.3839 7.2700 18.3871 8.2554 3.1404 23.2966 2.2984 30.7955 1.8589 37.2014 0.2130 6.5507
temp: 298.150 k
press: 1.00000 atm
elementType: 8 8 8 8 8 8 8 7 7 7 7 6 6 6 6 6 6 6 6 6 6 6 6 1 1 1 1 1 1 1 1 1 1 1 1
symmnumber: 1
zpe: 644213.2 jmol-1
zpe.correction: 0.245368 hartree
zpe.thermalcorrener: 0.267317 hartree
zpe.thermalcorrenthalpy: 0.268261 hartree
zpe.thermalcorrgfe: 0.189324 hartree
zpe.sumelectzpe: -1208.241447 hartree
zpe.sumelectthermal: -1208.219499 hartree
zpe.sumelectthermalent: -1208.218554 hartree
zpe.sumelectthermalfe: -1208.297491 hartree
dipole: 3.4276 0.9749 0.3038
dipole: 3.5765
quadrupole: -195.9791 -120.7452 -139.7137
quadrupole: 9.7369 -18.8732 -5.0368
quadrupole: -43.8331 31.4008 12.4323 9.7369 -18.8732 -5.0368
hfenergy: -1208.4868151 hartree
pointgroup: C01 [X(C12H12N4O7)]
dipole: -1.351278 -0.3746593 0.1168509 debye
polarizability: 405.4260041|-41.165069|125.7079087|-12.4997819|-15.4299971|172.1749544 unknown
InChI: InChI=1S/C12H12N4O7/c1-2-22-11(18)7-14-9(17)6-15(12(14)19)13-5-8-3-4-10(23-8)16(20)21/h3-5H,2,6-7H2,1H3
charge 0 multiplicity 1
35 atoms
O  -3.214021 1.898287 -2.050768
O  -4.237325 -1.055099 -0.252919
O  -1.851726 0.36084 2.179872
O  3.995904 0.066391 -0.54346
O  -6.227049 -0.218452 0.636305
O  7.390299 -0.815338 0.193666
O  6.425119 -0.045454 -1.751022
N  -2.849764 1.186667 0.178636
N  -0.62841 0.753452 0.1456
N  0.585127 0.369946 0.639328
N  6.376004 -0.407245 -0.510432
C  -0.953465 1.229643 -1.218266
C  -2.466132 1.49131 -1.135174
C  -1.773325 0.713069 0.990799
C  -4.227573 1.197477 0.651687
C  -5.018835 -0.084408 0.350101
C  1.637981 0.410493 -0.161503
C  2.91723 0.003536 0.366053
C  -4.927068 -2.353203 -0.564631
C  3.374477 -0.458753 1.610396
C  5.116843 -0.366697 0.172126
C  4.778444 -0.694359 1.484487
C  -3.875835 -3.276554 -1.167636
H  -0.740809 0.464111 -1.987539
H  -0.411836 2.158501 -1.476841
H  -4.767896 2.039898 0.187647
H  -4.226742 1.339911 1.74645
H  1.625628 0.733194 -1.215332
H  -5.35277 -2.74424 0.376409
H  -5.756994 -2.135713 -1.260099
H  2.750693 -0.600642 2.489493
H  5.469466 -1.055652 2.241435
H  -4.335861 -4.251368 -1.411113
H  -3.459764 -2.850595 -2.096637
H  -3.049917 -3.451952 -0.457519
