program: Gaussian 09
title: 000183483
version: EM64L-G09RevD.01
frameworkgroup: C1[X(C24H24O4)]
method: RPBEPBE
basis: SDD
operation: Freq
keyword: #pfreq=noraman
keyword: PBEPBE/SDD
title: #p freq=noraman PBEPBE/SDD
converged: YES YES NO NO
title: Mulliken charges:
elementType: O O O O C C C C C C C C C C C C C C C C C C C C C C C C H H H H H H H H H H H H H H H H H H H H H H H H
charge: -0.289194 -0.263040 -0.212472 -0.311013 -0.106030 -0.096712 -0.708344 -0.703674 0.207615 0.400534 -0.493360 0.525479 -0.548811 -0.326403 -0.401216 -0.396175 0.343375 -0.199434 -0.394872 -0.239264 -0.196889 -0.261190 0.346209 -0.356989 -0.385766 -0.207054 -0.193673 -0.250704 0.219594 0.240293 0.240456 0.207236 0.232814 0.216282 0.207687 0.240245 0.246740 0.228890 0.273086 0.251366 0.249411 0.273921 0.235137 0.261499 0.225237 0.226918 0.227365 0.265414 0.258059 0.229417 0.230811 0.231191
chargesum: 0.00000
title: Mulliken charges with hydrogens summed into heavy atoms:
elementType: O O O O C C C C C C C C C C C C C C C C C C C C C C C C
charge: -0.289194 -0.263040 -0.212472 -0.311013 0.113564 0.143580 -0.027838 -0.039460 0.207615 0.400534 -0.017730 0.525479 -0.275726 -0.075037 -0.151805 -0.122254 0.343375 0.035703 -0.133373 -0.014026 0.030029 -0.033825 0.346209 -0.091575 -0.127707 0.022363 0.037137 -0.019513
polarizability: 3.39332455e+02 1.95490934e+01 2.78555874e+02 1.75123727e+01 1.26592752e+01 1.95791467e+02
1716.lowfreq: -10.9769 -3.3276 -0.0003 0.0002 0.0004 4.6787 6.6871 10.4798 17.4541
frequency: -5.2953 10.2719 17.3826 29.2278 32.3594 45.9811 51.6594 57.9582 65.8032 76.5346 111.1405 122.0426 159.7282 171.0552 192.2860 197.5364 213.1654 219.3042 231.9675 240.0271 248.0450 292.9700 301.9805 321.0168 334.3878 357.5828 393.9303 407.7817 410.9613 411.2845 440.1709 460.1150 481.7823 502.8879 515.4251 541.8975 563.1773 592.0991 606.0955 612.5657 617.8970 633.4461 652.8253 692.2360 692.3830 692.7373 701.3000 725.0425 757.6985 762.5474 794.6933 808.8139 815.1246 823.1591 834.7779 837.7753 840.6430 883.6426 893.4891 900.0766 913.8400 919.5472 925.5694 930.0737 961.6557 962.9081 969.1252 969.8670 982.1524 984.6948 985.2295 986.7687 988.0103 988.4258 993.1370 1007.4662 1019.3231 1023.4570 1077.3247 1078.1428 1087.7582 1087.8297 1123.8850 1137.0019 1141.2967 1166.7886 1167.7843 1172.9565 1176.2879 1182.3903 1188.4238 1199.8383 1210.8514 1230.3306 1251.5433 1266.4453 1303.0565 1306.6268 1311.4273 1316.6824 1324.7065 1343.6415 1347.0710 1379.7957 1380.4522 1386.9078 1389.4410 1400.6069 1436.2772 1442.9751 1443.5902 1464.5925 1465.3187 1470.2947 1474.4304 1476.4315 1479.9185 1480.0968 1493.3995 1592.1020 1593.5683 1594.2490 1608.1519 1611.2059 1612.3664 1649.6001 2980.2883 2986.0664 2990.1882 2995.7477 3038.2329 3072.7769 3082.9570 3091.5516 3099.7016 3115.3088 3127.6916 3131.5383 3136.1827 3139.8764 3140.5419 3146.3960 3151.2305 3156.4729 3157.9171 3160.9642 3165.3443 3172.0389 3174.0833 3175.1822
redmass: 5.7635 5.5664 5.1161 4.9018 4.3726 4.8064 4.7629 4.4714 3.0828 3.8903 4.0866 5.4765 5.3066 5.7412 4.0666 1.1023 2.3836 4.5683 4.8326 1.3353 5.0124 5.4486 5.8641 3.2953 4.0068 5.5500 2.6851 2.8495 2.9447 2.9338 3.4761 3.5082 3.3104 2.9355 4.8135 5.5270 7.5510 5.6597 6.0066 6.4627 5.4241 4.6386 5.8553 2.1917 3.1747 2.3798 5.3426 2.8789 1.6165 1.6172 4.0848 2.0761 3.6618 1.4335 1.4630 2.5206 3.0530 2.8253 1.4449 1.7096 1.4964 1.4176 1.1945 2.9336 1.4556 1.4394 1.8370 1.9766 1.5563 3.1113 2.7755 5.2031 1.5164 1.5517 2.6953 2.1514 2.0803 2.0734 1.5504 2.0937 1.9909 1.5539 2.4191 2.0773 1.9233 1.0853 1.1434 1.1498 1.1324 1.2194 1.8870 2.5418 3.0336 1.1588 4.0289 1.2938 1.3261 1.3465 1.3012 1.3330 1.4489 1.3233 1.3456 1.2071 7.6846 7.5632 8.4400 1.2110 2.6799 2.3940 2.3567 1.0449 1.1488 2.2563 1.0514 2.1387 1.1442 2.1395 1.0581 6.3698 6.4419 6.3786 6.5031 6.4065 6.4974 9.8651 1.0386 1.0789 1.0456 1.0745 1.0586 1.0994 1.0996 1.1000 1.0993 1.1076 1.0847 1.0850 1.0886 1.0873 1.0891 1.0918 1.0928 1.0930 1.0937 1.0960 1.0965 1.1006 1.0984 1.1003
irintensity: 0.0955 0.0279 0.3000 1.4075 0.0230 1.1290 0.8045 0.8917 0.2270 1.1638 0.5598 0.2399 1.1843 1.6002 0.3339 0.0736 1.3240 1.8220 3.7034 0.1013 7.4466 0.7375 2.5786 0.6383 1.4407 1.5522 3.4560 13.5931 0.3370 0.0947 2.0018 4.8178 15.8057 10.3923 10.0391 11.1283 0.4435 2.2887 0.3871 1.6575 1.1407 5.7746 7.6183 32.6636 21.3796 28.4747 4.7710 10.0019 88.5798 95.3966 19.6633 40.9542 23.3151 5.0367 5.7446 6.8436 10.6302 64.8095 4.2761 12.2548 2.6673 0.7799 8.8733 36.1346 0.3027 3.6397 54.5048 52.5894 1.8213 3.9802 0.2956 0.4014 1.1598 1.1166 65.2917 7.7883 14.6000 30.7478 1.6284 166.7554 218.4560 7.4546 28.7650 3.3825 7.3118 8.5703 32.0263 43.6175 3.9800 42.5811 12.6799 185.6059 155.2275 11.4941 240.3839 23.7005 2.2114 8.3619 1.7567 2.9129 15.4244 19.0219 4.8634 19.4918 7.7591 7.6654 2.6204 26.7647 50.7463 21.0002 3.5949 3.3859 21.2404 162.7286 2.5078 83.3437 26.7935 19.5045 12.1224 25.5427 6.3667 171.8162 31.5341 62.1146 0.7528 123.9031 33.2244 1.2384 36.5450 22.9567 28.4117 32.4013 45.1815 14.0238 40.2713 5.3326 2.3131 1.8855 9.7556 5.4876 10.0657 8.8613 33.5107 24.6628 4.8013 19.4896 14.2868 8.6944 7.8506 7.4565
temp: 298.150 k
press: 1.00000 atm
elementType: 8 8 8 8 6 6 6 6 6 6 6 6 6 6 6 6 6 6 6 6 6 6 6 6 6 6 6 6 1 1 1 1 1 1 1 1 1 1 1 1 1 1 1 1 1 1 1 1 1 1 1 1
symmnumber: 1
zpe: 1094746.3 jmol-1
zpe.correction: 0.416967 hartree
zpe.thermalcorrener: 0.442180 hartree
zpe.thermalcorrenthalpy: 0.443125 hartree
zpe.thermalcorrgfe: 0.358221 hartree
zpe.sumelectzpe: -1227.820145 hartree
zpe.sumelectthermal: -1227.794931 hartree
zpe.sumelectthermalent: -1227.793987 hartree
zpe.sumelectthermalfe: -1227.878891 hartree
dipole: -1.9632 -1.7092 -1.2071
dipole: 2.8692
quadrupole: -161.0623 -150.0439 -167.0123
quadrupole: 5.2366 -3.1569 0.4471
quadrupole: -1.6895 9.3289 -7.6394 5.2366 -3.1569 0.4471
hfenergy: -1228.2371117 hartree
pointgroup: C01 [X(C24H24O4)]
dipole: -0.8494606 -0.6850648 -0.2887974 debye
polarizability: 343.1741111|16.5099644|273.7790387|14.9461494|-13.3353872|196.7266465 unknown
InChI: InChI=1S/C24H24O4/c1-18(2)23(28-21-13-7-4-8-14-21)24(25)26-17-19-10-9-15-22(16-19)27-20-11-5-3-6-12-20/h3-16,18,23H,17H2,1-2H3
charge 0 multiplicity 1
52 atoms
O  3.892888 -1.141622 -0.113511
O  0.521516 -1.178349 1.256198
O  2.397838 -0.067144 2.110628
O  -4.207602 1.823201 -0.10717
C  2.932189 -3.165625 0.832925
C  2.620686 -1.746413 0.273137
C  3.895194 -3.116041 2.04105
C  3.485033 -4.063165 -0.298013
C  1.88878 -0.881385 1.314535
C  3.870885 0.021804 -0.910463
C  -0.373668 -0.433612 2.221246
C  -0.994821 0.767984 1.54524
C  -2.30416 0.678612 1.013641
C  2.693841 0.687642 -1.332138
C  5.145326 0.505246 -1.292858
C  -0.271426 1.984877 1.441761
C  -2.875844 1.801765 0.37371
C  -0.861268 3.100193 0.806761
C  -2.164182 3.016939 0.269117
C  2.808328 1.840818 -2.14363
C  5.241794 1.65506 -2.100877
C  4.073789 2.330227 -2.533939
C  -4.82187 0.656144 -0.633604
C  -4.124025 -0.288385 -1.422557
C  -6.211744 0.539385 -0.414158
C  -4.837807 -1.370733 -1.983902
C  -6.911908 -0.545255 -0.986179
C  -6.229426 -1.506662 -1.768623
H  1.956147 -3.575367 1.164618
H  1.958812 -1.850735 -0.610415
H  4.864948 -2.682659 1.742549
H  4.071023 -4.137325 2.424531
H  3.49383 -2.502651 2.867144
H  3.681038 -5.081555 0.083485
H  2.770283 -4.145752 -1.138379
H  4.431426 -3.651732 -0.689926
H  0.241231 -0.145024 3.090934
H  -1.124318 -1.187435 2.504439
H  -2.873808 -0.252535 1.104883
H  1.698218 0.340183 -1.038458
H  6.03576 -0.0283 -0.946416
H  0.741605 2.0485 1.85314
H  -0.305644 4.040801 0.730691
H  -2.641678 3.870628 -0.220861
H  1.896349 2.356375 -2.465497
H  6.230703 2.025434 -2.393331
H  4.151821 3.223973 -3.161753
H  -3.051078 -0.174372 -1.605971
H  -6.718848 1.295891 0.192049
H  -4.303105 -2.103099 -2.598841
H  -7.9904 -0.638962 -0.818286
H  -6.775452 -2.347389 -2.209156
