program: Gaussian 09
title: 000183456
version: EM64L-G09RevD.01
frameworkgroup: C1[X(C11H19ClO)]
method: RPBEPBE
basis: SDD
operation: Freq
keyword: #p
keyword: freq=noraman
keyword: PBEPBE/SDD
title: #p freq=noraman PBEPBE/SDD
converged: YES YES NO NO
title: Mulliken charges:
elementType: Cl O C C C C C C C C C C C H H H H H H H H H H H H H H H H H H H
charge: -0.110648 -0.090653 -0.355395 -0.388019 -0.368370 -0.476228 -0.141285 -0.398509 -0.209169 -0.176272 -0.688103 -0.689146 -0.040375 0.188153 0.214221 0.197424 0.204381 0.216144 0.217581 0.202451 0.209431 0.205098 0.268356 0.267600 0.226292 0.230879 0.205866 0.219984 0.214227 0.213061 0.226154 0.204869
chargesum: 0.00000
title: Mulliken charges with hydrogens summed into heavy atoms:
elementType: Cl O C C C C C C C C C C C
charge: -0.110648 -0.090653 0.046979 0.013786 0.065356 -0.064346 0.063812 0.137448 0.017123 0.054607 -0.048026 -0.045062 -0.040375
polarizability: 1.55343087e+02 -2.25330651e+00 1.45409056e+02 -2.48288719e+00 1.01293673e+01 1.01082281e+02
1716.lowfreq: -9.0147 -6.5495 0.0007 0.0009 0.0022 6.1649 17.9161 18.4420 30.5432
frequency: 17.8502 18.3704 30.3298 59.8972 70.2606 90.1114 92.9376 119.6755 147.7800 172.9727 206.5337 210.7055 223.4029 254.8644 294.0368 334.1355 379.4590 389.7296 404.7719 443.6407 462.5817 466.3986 521.6873 702.3400 724.0697 762.8409 801.0006 836.3103 866.2492 881.4270 915.3352 933.0652 947.5869 952.4749 975.1312 977.1982 1012.6573 1056.9550 1062.7711 1084.2454 1098.3571 1108.7089 1116.6515 1167.3290 1178.0125 1196.4908 1228.9070 1247.8106 1258.3003 1281.1172 1284.8406 1290.2921 1299.3523 1303.6407 1314.1281 1344.8709 1348.9028 1358.7119 1372.3825 1389.9886 1424.1688 1458.6639 1463.7815 1465.3830 1467.3742 1467.9307 1477.9436 1484.0735 1486.3284 1681.6028 1760.3623 2956.6159 2960.8471 2968.6576 2969.3506 2971.9713 2979.0380 2988.1232 2996.4466 3002.5783 3017.9615 3028.2987 3038.1801 3050.5594 3061.3006 3062.0529 3063.2598 3070.0840 3074.7799 3080.8060
redmass: 4.1565 8.1330 3.0443 3.2285 4.5524 2.2587 2.4022 2.3781 2.1270 2.9308 1.0641 3.9925 1.9327 1.4204 2.4648 2.2972 4.8420 5.3858 3.6012 2.1172 2.8659 2.9918 2.7205 6.3602 1.1192 1.3291 1.6264 2.3633 1.7749 1.7989 1.1751 2.5841 2.5186 1.4386 1.6193 1.2553 2.0261 3.2063 2.6314 2.2493 1.9450 2.4848 1.3629 1.8552 1.5863 1.4887 1.3389 1.3063 1.2931 1.1932 1.2713 1.0854 1.3431 1.3496 1.2979 1.4671 1.5123 1.5618 1.1970 1.2074 1.0772 1.0934 1.0694 1.0457 1.0637 1.0734 1.0480 1.0981 1.0555 6.7207 10.9537 1.0594 1.0607 1.0606 1.0348 1.0355 1.0842 1.0609 1.0600 1.0971 1.0990 1.1005 1.1010 1.0923 1.0996 1.0997 1.0934 1.0971 1.1003 1.0996
irintensity: 0.2634 0.6805 0.7896 3.0733 1.9573 0.1658 0.2494 1.4017 0.3975 0.3308 0.0194 0.8258 4.0192 2.4534 4.6426 1.2227 7.2123 21.4042 12.6351 0.0961 0.0468 3.5608 2.0615 137.3188 13.5721 0.8458 1.3997 2.5725 6.1968 2.6976 0.7276 48.6510 70.2677 0.2655 41.2500 25.6877 20.6998 5.6012 13.2408 0.6869 0.3432 4.6549 1.8268 3.5598 13.9109 8.3253 8.8760 12.7935 6.1142 1.6940 1.2954 2.2220 0.5933 7.2268 0.5264 2.4072 3.3579 5.1663 15.7836 9.2402 34.9235 13.8633 0.4965 2.4604 2.1442 2.7292 12.0808 17.7926 17.1429 0.0460 240.1074 14.1423 21.3185 62.9854 32.6884 31.8801 13.8426 18.9897 22.1742 1.4595 26.1418 15.1088 28.3020 1.4791 23.1337 1.4858 51.7156 146.7442 35.7539 48.1472
temp: 298.150 k
press: 1.00000 atm
elementType: 17 8 6 6 6 6 6 6 6 6 6 6 6 1 1 1 1 1 1 1 1 1 1 1 1 1 1 1 1 1 1 1
symmnumber: 1
zpe: 718184.7 jmol-1
zpe.correction: 0.273542 hartree
zpe.thermalcorrener: 0.290254 hartree
zpe.thermalcorrenthalpy: 0.291198 hartree
zpe.thermalcorrgfe: 0.225316 hartree
zpe.sumelectzpe: -964.796994 hartree
zpe.sumelectthermal: -964.780282 hartree
zpe.sumelectthermalent: -964.779338 hartree
zpe.sumelectthermalfe: -964.845220 hartree
dipole: 3.9438 0.6372 -0.7254
dipole: 4.0602
quadrupole: -114.5258 -89.1684 -85.9506
quadrupole: -3.8116 4.4628 -1.7090
quadrupole: -17.9776 7.3799 10.5977 -3.8116 4.4628 -1.7090
hfenergy: -965.0705361 hartree
pointgroup: C01 [X(C11H19Cl1O1)]
dipole: -1.5371124 0.3665085 0.2338819 debye
polarizability: 155.7119482|1.6829199|144.0502886|-2.0534092|-12.0636427|102.0721877 unknown
InChI: InChI=1S/C11H19ClO/c1-10(2)8-6-4-3-5-7-9-11(12)13/h6,8,10H,3-5,7,9H2,1-2H3
charge 0 multiplicity 1
32 atoms
Cl 5.105726 -2.183503 0.558088
O  4.98093 0.257698 -0.692541
C  0.663887 0.832707 0.368693
C  -0.080712 2.112222 -0.071686
C  2.14053 0.819689 -0.084006
C  -1.576734 2.128259 0.351693
C  -3.942728 -0.982418 -0.411749
C  2.859027 -0.468463 0.370022
C  -2.406896 1.065242 -0.34091
C  -3.108476 0.081671 0.280504
C  -3.372966 -2.397791 -0.122881
C  -5.426994 -0.89296 0.032598
C  4.306019 -0.538464 -0.055763
H  0.612229 0.744914 1.47439
H  0.135765 -0.052617 -0.038967
H  -0.013866 2.215721 -1.174629
H  0.426331 2.999778 0.35819
H  2.669526 1.70248 0.324154
H  2.195706 0.905376 -1.186422
H  -1.652203 2.003819 1.450413
H  -1.992461 3.12975 0.114479
H  -3.895505 -0.804828 -1.505648
H  2.355213 -1.373237 -0.023594
H  2.834656 -0.580272 1.472085
H  -2.426491 1.114388 -1.442839
H  -3.090986 0.027575 1.382849
H  -3.379469 -2.60723 0.964158
H  -2.331356 -2.489719 -0.480243
H  -3.981112 -3.176492 -0.620413
H  -6.036716 -1.664044 -0.474785
H  -5.853881 0.098603 -0.201536
H  -5.518596 -1.054155 1.124093
