program: Gaussian 09
title: 000183437
version: EM64L-G09RevD.01
frameworkgroup: C1[X(C14H8Cl3NO3)]
method: RPBEPBE
basis: SDD
operation: Freq
keyword: #p
keyword: freq=noraman
keyword: PBEPBE/SDD
title: #p freq=noraman PBEPBE/SDD
converged: YES YES NO NO
title: Mulliken charges:
elementType: Cl Cl Cl O O O N C C C C C C C C C C C C C C H H H H H H H H
charge: -0.045814 0.003846 0.002739 -0.267359 -0.267937 -0.251852 -0.446780 0.300324 0.239328 0.262016 0.272588 0.732999 -0.521940 -0.406121 -0.453144 -0.350570 -0.353109 -0.084170 -0.083132 0.224855 -0.795732 0.346151 0.286881 0.291864 0.289102 0.320717 0.241772 0.270690 0.241792
chargesum: 0.00000
title: Mulliken charges with hydrogens summed into heavy atoms:
elementType: Cl Cl Cl O O O N C C C C C C C C C C C C C C
charge: -0.045814 0.003846 0.002739 -0.267359 -0.267937 -0.251852 -0.126063 0.300324 0.239328 0.262016 0.272588 0.732999 -0.175790 -0.119240 -0.453144 -0.058706 -0.064007 -0.084170 -0.083132 0.224855 -0.041478
polarizability: 3.76112240e+02 1.36642926e+00 2.07236773e+02 -1.09517635e-03 2.82396000e-05 7.62729255e+01
1716.lowfreq: -68.3275 -3.4604 -0.0021 -0.0018 0.0005 1.9838 4.6191 23.8679 37.9096
frequency: -68.3237 23.8627 37.8992 69.3947 83.4646 85.8118 116.6980 138.5468 147.2984 177.8010 185.8077 197.8274 229.7705 234.3760 263.6612 284.0416 304.1470 362.4401 366.2188 388.8699 395.1691 443.9738 450.3234 454.2681 500.3375 512.4324 534.7968 571.7826 585.5650 609.8782 617.0485 621.2000 657.3507 659.8955 678.0690 714.4680 718.0381 728.1660 787.0379 839.5793 846.9367 847.0354 866.4467 895.2277 922.9687 933.5335 966.1155 1011.3930 1033.9521 1098.7662 1100.7839 1108.9696 1162.4324 1217.1649 1225.7588 1231.8588 1252.7385 1301.6931 1354.7969 1365.7495 1373.9689 1379.5164 1419.9688 1444.0063 1462.4726 1467.6158 1475.9556 1506.9972 1573.7463 1587.0921 1607.0153 1634.1139 1641.1214 2990.6424 3075.6712 3138.7144 3182.2551 3184.3466 3184.6446 3186.8448 3488.7976
redmass: 1.0363 10.9093 13.6286 5.4268 7.4783 6.2604 10.1425 10.5022 9.1691 24.8266 6.9222 14.2854 5.7364 9.6745 9.1148 7.2022 7.2540 10.3956 11.8874 9.4592 9.7583 3.1036 3.2488 7.6910 5.3635 6.3270 8.7803 3.9628 7.5674 8.9170 6.8094 6.3144 7.3532 3.7298 1.6293 2.1243 7.3217 7.4677 5.8508 1.4243 5.9443 1.4030 1.3865 7.4072 1.3747 6.4301 2.5269 2.0803 1.6639 1.8679 4.5324 9.0973 2.0341 1.2496 1.4135 3.1415 4.0345 4.3521 8.3548 8.3263 5.2954 1.3152 9.1905 1.2184 3.5465 1.0462 2.5140 2.6676 7.3490 8.5594 8.3921 5.1379 7.9498 1.0384 1.0982 1.0982 1.0923 1.0932 1.0925 1.0932 1.0765
irintensity: 0.2336 0.3426 0.3238 10.6034 1.8599 0.0503 0.0727 3.3649 0.6042 0.2859 0.2963 0.0529 0.0086 1.7888 2.7370 0.0164 0.4664 2.8780 2.4427 4.2861 17.7579 3.1082 16.4003 12.5892 0.4119 0.4460 3.1120 1.3020 0.0948 1.9965 0.5084 15.9287 8.6795 1.5491 35.1529 39.5343 3.2530 19.5306 5.3138 0.1407 222.6252 14.1386 55.2985 33.9623 54.3818 2.6802 41.2519 13.4517 8.8205 138.6513 28.4404 13.4266 61.4269 2.0757 11.7559 89.8421 380.4541 113.6992 1.6210 145.4186 63.3218 69.4007 64.1941 81.2274 844.5605 20.5066 9.0128 709.6638 23.3588 0.5597 28.4352 101.2545 16.6998 6.1557 12.4506 6.0839 2.6032 2.1171 14.6736 21.6008 45.5770
temp: 298.150 k
press: 1.00000 atm
elementType: 17 17 17 8 8 8 7 6 6 6 6 6 6 6 6 6 6 6 6 6 6 1 1 1 1 1 1 1 1
symmnumber: 1
zpe: 493622.0 jmol-1
zpe.correction: 0.188011 hartree
zpe.thermalcorrener: 0.206129 hartree
zpe.thermalcorrenthalpy: 0.207073 hartree
zpe.thermalcorrgfe: 0.140126 hartree
zpe.sumelectzpe: -2197.420206 hartree
zpe.sumelectthermal: -2197.402087 hartree
zpe.sumelectthermalent: -2197.401143 hartree
zpe.sumelectthermalfe: -2197.468091 hartree
dipole: -4.4885 -2.0408 0.0003
dipole: 4.9306
quadrupole: -126.7313 -146.6208 -143.2305
quadrupole: 1.4622 -0.0014 0.0006
quadrupole: 12.1296 -7.7600 -4.3696 1.4622 -0.0014 0.0006
hfenergy: -2197.6082165 hartree
pointgroup: C01 [X(C14H8Cl3N1O3)]
dipole: 1.7124065 -0.9114506 0.000906 debye
polarizability: 375.2856676|-11.8647123|208.0631974|0.0203145|-0.139869|76.2730741 unknown
InChI: InChI=1S/C14H8Cl3NO3/c1-6(19)18-10-5-14-13(4-9(10)17)20-11-2-7(15)8(16)3-12(11)21-14/h2-5,18H,1H3
charge 0 multiplicity 1
29 atoms
Cl 3.955553 -2.849439 0.002994
Cl -5.61335 2.28797 -0.002732
Cl -6.23262 -0.948748 0.000671
O  -0.569347 1.138943 -0.001309
O  -1.118387 -1.739728 0.001762
O  3.995945 2.506128 -0.002575
N  4.229882 0.168885 -0.000232
C  0.473752 0.173605 -0.000269
C  0.203068 -1.215291 0.001209
C  -1.886547 0.619498 -0.00081
C  -2.153872 -0.772677 0.000667
C  2.879845 -0.249462 0.000203
C  1.786275 0.659368 -0.000778
C  1.266076 -2.130243 0.002194
C  2.581357 -1.640309 0.001686
C  -2.944282 1.540341 -0.001834
C  -3.476442 -1.238552 0.001107
C  -4.275662 1.073229 -0.00139
C  -4.54103 -0.312544 0.000073
C  4.732005 1.478249 -0.001579
C  6.25694 1.546437 -0.001591
H  1.981065 1.733394 -0.001919
H  1.056657 -3.202318 0.003337
H  -2.723236 2.610412 -0.002966
H  -3.667478 -2.314302 0.002252
H  4.916903 -0.592057 0.00056
H  6.680315 1.054574 0.893561
H  6.560498 2.602784 -0.00232
H  6.680314 1.053353 -0.896073
