program: Gaussian 09
title: 000183427
version: EM64L-G09RevD.01
frameworkgroup: C1[X(C13H23F3OS)]
method: RPBEPBE
basis: SDD
operation: Freq
keyword: #p
keyword: freq=noraman
keyword: PBEPBE/SDD
title: #p freq=noraman PBEPBE/SDD
converged: YES YES NO NO
title: Mulliken charges:
elementType: S F F F O C C C C C C C C C C C C C H H H H H H H H H H H H H H H H H H H H H H H
charge: 0.169369 -0.174810 -0.144079 -0.145338 -0.135053 -0.429436 -0.357481 -0.394881 -0.377953 -0.374268 -0.348915 -0.354151 -0.356656 -0.683602 -0.731640 -0.696625 0.175788 0.358523 0.209851 0.230457 0.220749 0.192616 0.290316 0.188307 0.192672 0.196079 0.190978 0.211565 0.208847 0.187831 0.186535 0.195445 0.197100 0.227170 0.230962 0.217353 0.303951 0.287893 0.208854 0.215989 0.209690
chargesum: 0.00000
title: Mulliken charges with hydrogens summed into heavy atoms:
elementType: S F F F O C C C C C C C C C C C C C
charge: 0.169369 -0.174810 -0.144079 -0.145338 -0.135053 0.010872 0.055884 -0.104564 0.003026 0.012789 0.071497 0.020215 0.035889 -0.008118 -0.139797 -0.062092 0.175788 0.358523
polarizability: 1.88999486e+02 1.05161087e+01 1.82853220e+02 5.86875634e+00 1.00831731e+01 1.35156400e+02
1716.lowfreq: -4.2079 -0.0021 -0.0019 -0.0019 4.9831 11.2353 13.5263 23.6109 28.9353
frequency: 12.2474 23.1223 28.1149 34.2270 45.3823 57.5983 69.5071 81.9120 95.0760 97.1672 122.2570 136.0365 142.0040 153.0632 161.0020 191.4744 212.9609 219.7623 221.6525 236.5769 243.4144 290.5222 333.1054 347.5436 362.7139 379.9789 438.2207 450.2139 465.9970 493.1603 521.9658 552.3805 602.0552 617.1667 676.1762 718.1543 720.4650 727.9445 756.6909 783.5389 823.9555 866.7338 887.3430 888.7792 908.0617 963.0676 992.1075 1006.0903 1008.1268 1020.2471 1021.7896 1028.1628 1041.2839 1054.1766 1075.9426 1079.7688 1084.0834 1097.0281 1114.1820 1126.6150 1150.8662 1187.5804 1203.4303 1217.0740 1223.7878 1240.5136 1248.5642 1254.5414 1267.3613 1280.2312 1284.6243 1292.3534 1295.8700 1300.2585 1324.3103 1342.9916 1355.1339 1357.3935 1360.5130 1386.6359 1390.4447 1421.5323 1454.0102 1459.9345 1461.7633 1463.0142 1468.4708 1475.0647 1475.7834 1479.0751 1483.2510 1487.6977 1488.1904 1631.4895 2949.2365 2951.3047 2957.2639 2958.7989 2962.3831 2968.0540 2970.5746 2971.3156 2984.9208 2986.1441 2994.8080 3006.5767 3012.9367 3015.9996 3032.6376 3041.4541 3048.7217 3059.9242 3067.7291 3070.5836 3081.7890 3083.7984 3148.2287
redmass: 7.5338 7.5888 3.2663 3.9435 2.3820 3.9438 5.5340 3.1923 2.5269 1.9127 5.4761 2.6329 1.9015 3.4882 3.8140 2.1432 2.7291 3.0665 1.5009 2.0728 4.8529 2.6941 3.5557 3.0793 3.0513 12.3638 14.8779 3.1463 3.2261 5.0186 3.4591 7.4357 3.0647 7.7977 8.3993 7.1121 1.0637 1.0958 1.1641 1.2093 1.2555 2.9989 1.8772 1.8471 1.3224 2.1612 1.2549 3.7585 3.2775 9.5958 2.9266 10.2789 1.3507 2.9563 2.5464 1.9166 1.7695 1.6896 1.6763 2.5775 2.2213 1.6978 1.3334 1.3108 1.3079 1.3178 2.4202 1.3090 1.2232 1.2139 1.0457 1.2405 1.1013 1.1506 1.4244 1.4719 1.5476 1.6046 1.4789 1.2183 1.2217 1.1048 1.0727 1.0752 1.0718 1.0709 1.0754 1.0560 1.0604 1.0460 1.0848 1.0550 1.0929 11.3066 1.0591 1.0589 1.0609 1.0596 1.0605 1.0610 1.0560 1.0416 1.0365 1.0962 1.0987 1.0964 1.0996 1.1023 1.1030 1.0912 1.0995 1.0570 1.1008 1.0992 1.0997 1.1002 1.1088
irintensity: 0.6588 0.3517 0.2431 0.1633 0.1303 0.1066 0.4381 0.2762 0.1561 0.0416 0.6549 0.1537 0.1128 1.5169 0.7021 0.2149 1.6593 1.7591 0.6846 0.9962 6.0471 1.9768 2.6886 1.3181 2.5964 3.9299 6.2663 1.7068 0.8602 10.0757 6.5567 23.1210 10.7468 6.1130 1.2527 7.6872 14.5334 0.1091 2.7307 14.4004 3.1575 8.2687 7.8753 4.9058 5.6099 2.4743 2.4694 50.4599 87.9643 162.0334 3.2110 234.6076 0.4959 0.2029 2.3522 1.5315 5.9284 11.1273 74.3632 5.1557 3.1227 1.0006 0.6061 10.9979 7.6977 5.5532 7.3910 1.0043 2.3790 10.4652 1.5362 2.2204 0.5366 10.0165 2.1482 0.3212 0.9539 0.2159 3.3469 10.9770 28.6652 17.4686 6.2438 4.4704 0.0280 0.4886 1.8007 10.0747 3.8186 8.7715 1.5980 11.8508 24.5829 222.0645 0.9746 4.3540 15.2379 16.5268 34.4157 2.4280 163.9940 26.3171 26.0775 4.4765 2.9734 8.1125 22.4468 4.5542 22.6820 21.4579 103.9061 3.8859 100.5702 53.9225 37.2000 43.6914 0.5721
temp: 298.150 k
press: 1.00000 atm
elementType: 16 9 9 9 8 6 6 6 6 6 6 6 6 6 6 6 6 6 1 1 1 1 1 1 1 1 1 1 1 1 1 1 1 1 1 1 1 1 1 1 1
symmnumber: 1
zpe: 887922.4 jmol-1
zpe.correction: 0.338192 hartree
zpe.thermalcorrener: 0.361032 hartree
zpe.thermalcorrenthalpy: 0.361976 hartree
zpe.thermalcorrgfe: 0.281651 hartree
zpe.sumelectzpe: -1280.516097 hartree
zpe.sumelectthermal: -1280.493257 hartree
zpe.sumelectthermalent: -1280.492312 hartree
zpe.sumelectthermalfe: -1280.572638 hartree
dipole: -0.0014 4.2963 2.0124
dipole: 4.7443
quadrupole: -114.7981 -124.3475 -121.3152
quadrupole: -10.1399 -5.5518 0.0965
quadrupole: 5.3555 -4.1939 -1.1616 -10.1399 -5.5518 0.0965
hfenergy: -1280.8542885 hartree
pointgroup: C01 [X(C13H23F3O1S1)]
dipole: -0.2468893 -1.6660735 0.8045088 debye
polarizability: 191.5375321|8.5191344|179.5513874|-9.9033267|-9.3763963|135.9201864 unknown
InChI: InChI=1S/C13H23F3OS/c1-3-5-6-7-8-9-11(4-2)18-10-12(17)13(14,15)16/h11H,3-10H2,1-2H3
charge 0 multiplicity 1
41 atoms
S  1.229081 -1.207443 -1.227432
F  1.776726 0.97325 1.436542
F  0.836504 2.236675 -0.205357
F  2.80933 2.858338 0.720761
O  3.382703 1.593311 -1.74347
C  -1.028158 -1.952739 0.262718
C  -1.699826 -0.562872 0.318431
C  0.508653 -1.918172 0.419015
C  -3.234239 -0.629731 0.148684
C  -3.906643 0.759823 0.216336
C  1.154579 -3.281093 0.754413
C  -5.439107 0.71083 0.023278
C  -6.10732 2.102956 0.091237
C  0.835987 -4.418316 -0.238458
C  2.927867 -0.550199 -0.649258
C  -7.637106 2.047863 -0.111006
C  2.867306 0.948917 -0.803465
C  2.064588 1.749861 0.279616
H  -1.426752 -2.586645 1.083085
H  -1.304354 -2.466539 -0.680046
H  -1.269404 0.086669 -0.468576
H  -1.45671 -0.079416 1.287512
H  0.782559 -1.170892 1.185514
H  -3.668854 -1.286386 0.931848
H  -3.475535 -1.104876 -0.825434
H  -3.460584 1.418177 -0.557863
H  -3.674855 1.231605 1.194186
H  0.806665 -3.56617 1.770056
H  2.253857 -3.156466 0.831688
H  -5.671537 0.242644 -0.956426
H  -5.88826 0.052143 0.796279
H  -5.878802 2.569182 1.07143
H  -5.654425 2.761207 -0.678015
H  -0.243861 -4.649473 -0.258355
H  1.147024 -4.141794 -1.262229
H  1.371262 -5.342168 0.044973
H  3.703642 -0.96552 -1.307291
H  3.079078 -0.870294 0.39285
H  -8.117042 1.420542 0.664047
H  -8.090576 3.054856 -0.058952
H  -7.890667 1.613654 -1.096767
