program: Gaussian 09
title: 000183408
version: EM64L-G09RevD.01
frameworkgroup: C1[X(C17H12O6)]
method: RPBEPBE
basis: SDD
operation: Freq
keyword: #pfreq=noraman
keyword: PBEPBE/SDD
title: #p freq=noraman PBEPBE/SDD
converged: NO NO NO NO
title: Mulliken charges:
elementType: O O O O O O C C C C C C C C C C C C C C C C C H H H H H H H H H H H H
charge: -0.281281 -0.260178 -0.255711 -0.308468 -0.419549 -0.203643 0.008684 0.401081 0.338363 0.260757 0.140372 0.218628 -0.466020 -0.499828 -0.555893 -0.545759 -0.508102 0.382832 0.107493 0.235747 0.108018 -0.535186 -0.521332 0.242982 0.260640 0.284972 0.279251 0.279051 0.384043 0.229797 0.249781 0.229736 0.250292 0.234180 0.234250
chargesum: 0.00000
title: Mulliken charges with hydrogens summed into heavy atoms:
elementType: O O O O O O C C C C C C C C C C C C C C C C C
charge: -0.281281 -0.260178 -0.255711 -0.308468 -0.035506 -0.203643 0.008684 0.401081 0.338363 0.260757 0.140372 0.218628 -0.223038 -0.239188 -0.270921 -0.266508 -0.229051 0.382832 0.107493 0.235747 0.108018 0.174127 0.197391
polarizability: 3.64575967e+02 -5.64274111e+00 2.69055606e+02 -7.00374545e-03 2.29289917e-02 8.78449551e+01
1716.lowfreq: -6.4648 -1.8488 -0.0006 -0.0002 0.0003 6.5580 42.2871 48.9756 87.2315
frequency: 42.2869 48.9669 87.2314 103.2403 113.1331 119.0670 150.4062 173.7389 185.5694 191.3955 208.8162 215.0529 236.4716 258.4876 271.1267 281.9179 288.0086 306.6681 334.9574 381.7974 406.5821 414.9944 444.6892 451.4498 459.7132 474.1012 499.8799 562.2226 573.7769 578.0095 586.2298 594.8163 632.5215 632.5839 655.5109 679.7102 683.3514 698.1889 721.4264 740.7416 758.8440 761.7617 798.0923 837.9330 845.3243 849.3878 856.3499 877.8403 880.6790 924.0850 987.9876 1011.2854 1034.5205 1087.8969 1110.9273 1112.2927 1118.5156 1139.6182 1154.1499 1160.9604 1163.5959 1175.8122 1194.0781 1211.5218 1238.6158 1277.6777 1301.7991 1311.8130 1357.2916 1393.7390 1404.7008 1434.7974 1439.2906 1441.8719 1466.7425 1467.7665 1468.3737 1473.2764 1479.0360 1505.8486 1507.0354 1548.8595 1576.6483 1607.4967 1629.9142 1647.2341 1693.8482 2970.3108 2975.8068 3062.4490 3069.7152 3134.0495 3138.7551 3175.8167 3181.0104 3188.6766 3190.5311 3194.1980 3520.9936
redmass: 5.5722 4.6776 4.8303 5.5742 4.3252 4.7051 5.7801 4.0951 2.4639 4.9619 1.5029 2.3349 2.3045 3.0887 5.5576 6.0374 4.1778 5.2748 7.2174 6.4758 9.8996 8.6689 2.8548 6.7476 6.5051 1.1204 7.5960 6.2270 5.0316 5.5223 6.2477 7.7143 5.8580 4.6986 3.2095 9.2289 6.3344 7.9862 2.8816 7.4060 3.9624 5.0901 5.7130 1.4799 1.5464 1.7281 1.7817 5.8994 1.5176 6.9967 6.4485 3.2792 5.5203 5.1151 4.9213 1.2588 1.2543 2.1913 1.4036 1.9573 1.8171 3.0796 1.5800 1.4614 1.5857 1.5189 5.0977 8.0462 3.3351 6.2594 4.2759 2.2377 1.2267 1.9593 1.0490 1.0501 1.4858 1.0964 1.9463 3.8621 5.2739 8.6912 7.7039 9.1544 8.1251 7.8016 10.7523 1.0325 1.0322 1.1044 1.1048 1.1003 1.1010 1.0921 1.0920 1.0904 1.0917 1.0931 1.0648
irintensity: 0.6422 1.6605 0.4579 8.4321 2.6359 1.0595 0.2517 3.3896 0.1099 2.3399 0.7424 0.8746 0.1919 0.1550 4.9637 4.2999 6.0360 0.3835 1.6250 15.7751 0.1620 1.0111 18.6676 20.6451 4.2430 134.2865 2.9767 6.0185 1.8187 0.0252 0.2110 36.1744 7.9702 6.7383 4.7686 18.2883 0.3124 3.1055 0.0115 56.4905 1.7530 8.1606 19.3380 4.4896 18.2170 26.1283 95.7254 41.4574 35.5757 31.2060 46.8207 56.4659 69.8325 98.7017 62.8034 0.1340 0.0828 264.6535 47.4799 88.5704 206.5612 81.6237 130.0825 57.3122 6.0874 68.2805 119.7216 63.7260 42.0179 51.0461 238.7493 22.2157 41.2314 49.9375 16.4878 15.2892 134.8167 37.5399 9.8606 240.9739 56.9033 12.8359 38.9666 227.5917 521.5323 364.3760 604.7945 67.7980 57.8796 38.9664 35.4227 22.7504 18.9214 0.9325 1.5025 2.8624 0.8352 0.2844 120.4681
temp: 298.150 k
press: 1.00000 atm
elementType: 8 8 8 8 8 8 6 6 6 6 6 6 6 6 6 6 6 6 6 6 6 6 6 1 1 1 1 1 1 1 1 1 1 1 1
symmnumber: 1
zpe: 664036.8 jmol-1
zpe.correction: 0.252918 hartree
zpe.thermalcorrener: 0.272116 hartree
zpe.thermalcorrenthalpy: 0.273060 hartree
zpe.thermalcorrgfe: 0.206228 hartree
zpe.sumelectzpe: -1104.732033 hartree
zpe.sumelectthermal: -1104.712836 hartree
zpe.sumelectthermalent: -1104.711891 hartree
zpe.sumelectthermalfe: -1104.778724 hartree
dipole: 3.5212 -7.8526 0.0037
dipole: 8.6059
quadrupole: -90.9495 -149.4543 -134.6020
quadrupole: 1.0749 -0.0090 -0.0189
quadrupole: 34.0525 -24.4524 -9.6000 1.0749 -0.0090 -0.0189
hfenergy: -1104.9849513 hartree
pointgroup: C01 [X(C17H12O6)]
dipole: 1.4211915 3.0498595 0.3773564 debye
polarizability: 364.4316349|3.5472146|266.7490798|8.9950342|19.7631523|90.2958133 unknown
InChI: InChI=1S/C17H12O6/c1-20-8-3-14-17-10(6-16(19)23-15(17)4-8)9-5-11(18)13(21-2)7-12(9)22-14/h3-7,18H,1-2H3
charge 0 multiplicity 1
35 atoms
O  0.36519 1.607947 0.258711
O  -2.827684 -2.071285 -0.243709
O  -4.302436 2.550977 0.217078
O  5.185864 0.889074 0.330537
O  4.8488 -1.753735 0.029982
O  -2.142588 -4.270864 -0.465477
C  -1.173332 -0.287197 0.002482
C  -0.093226 -1.247955 -0.070194
C  1.268622 -0.704835 0.031718
C  -0.947215 1.108871 0.162912
C  1.443001 0.699478 0.192055
C  -2.525679 -0.721837 -0.086629
C  -0.398733 -2.59738 -0.228404
C  2.440634 -1.51183 -0.020151
C  -1.989326 2.035767 0.232281
C  -3.605128 0.179903 -0.021002
C  2.717535 1.296236 0.297464
C  -3.323284 1.559205 0.138665
C  3.71223 -0.94448 0.082525
C  3.850461 0.472278 0.242491
C  -1.752081 -3.096451 -0.324405
C  -5.706872 2.133128 0.125936
C  5.448004 2.324031 0.492445
H  0.376492 -3.363277 -0.289419
H  2.373447 -2.595821 -0.140818
H  -1.792597 3.102175 0.355409
H  -4.620174 -0.214769 -0.09512
H  2.779946 2.380002 0.418252
H  5.654539 -1.178884 0.120641
H  -5.915648 1.646492 -0.845659
H  -6.285804 3.063788 0.210053
H  -5.973588 1.448001 0.952889
H  6.54212 2.417315 0.537403
H  4.997413 2.700005 1.429974
H  5.054796 2.892226 -0.371211
