program: Gaussian 09
title: 000183419
version: EM64L-G09RevD.01
frameworkgroup: C1[X(C12H14ClF2N5O3S)]
method: RPBEPBE
basis: SDD
operation: Freq
keyword: #p
keyword: freq=noraman
keyword: PBEPBE/SDD
title: #p freq=noraman PBEPBE/SDD
converged: YES YES NO NO
title: Mulliken charges:
elementType: Cl S F F O O O N N N N N C C C C C C C C C C C C H H H H H H H H H H H H H H
charge: -0.028084 0.995063 -0.161104 -0.233726 -0.523197 -0.526507 -0.224009 -0.197110 -0.346450 -0.554969 -0.016164 0.005289 -0.347940 0.385717 0.549058 -0.387851 -0.411520 -0.517108 0.272760 0.177937 -0.332679 -0.351474 -0.193641 -0.619847 0.246615 0.241890 0.246207 0.239586 0.333084 0.268698 0.269770 0.302792 0.289529 0.201985 0.196424 0.236887 0.253216 0.260873
chargesum: 0.00000
title: Mulliken charges with hydrogens summed into heavy atoms:
elementType: Cl S F F O O O N N N N N C C C C C C C C C C C C
charge: -0.028084 0.995063 -0.161104 -0.233726 -0.523197 -0.526507 -0.224009 -0.197110 -0.346450 -0.252177 -0.016164 0.005289 0.140566 0.385717 0.549058 0.097941 -0.078437 0.021360 0.272760 0.177937 -0.332679 -0.061944 0.204768 0.131128
polarizability: 3.07156185e+02 1.58092140e+01 2.32123938e+02 -4.31359191e+00 -1.46428441e+01 1.59090001e+02
1716.lowfreq: -11.2767 -6.8364 -2.7852 -0.0021 -0.0013 0.0006 10.0851 11.8911 15.7383
frequency: 9.1410 10.9512 15.5971 25.0429 37.7914 40.0662 49.9501 59.6007 67.2285 88.0562 102.3731 103.8184 133.8484 163.8846 172.6425 186.2522 191.3097 198.2592 215.8722 233.8362 245.7497 253.4165 258.9421 266.5879 290.5327 314.5711 332.7700 336.0310 376.3583 412.4492 438.0396 442.6701 449.9219 478.8271 491.8392 507.8913 529.8096 591.0691 623.8503 649.9837 676.6353 693.4806 699.9991 723.1181 758.9878 772.8141 775.6776 782.7640 796.1190 828.3743 844.6397 853.8846 888.9402 896.3837 946.1323 951.8482 966.5588 969.4037 994.6337 1037.0589 1048.8850 1055.4943 1063.8420 1072.4018 1079.8684 1145.7257 1157.7544 1212.0656 1232.2797 1242.2299 1244.1628 1250.9572 1262.1098 1268.3789 1279.8125 1286.7872 1308.3789 1346.9304 1349.3493 1375.3656 1382.6040 1392.7486 1394.5484 1411.0217 1412.7434 1458.4786 1462.5732 1475.1980 1480.4350 1486.5267 1488.5550 1574.3200 1603.7918 1683.6981 2992.3237 3000.6610 3011.3122 3023.3637 3047.0886 3059.1939 3071.6497 3085.9158 3097.3773 3108.1868 3142.1996 3186.9391 3192.8576 3408.9040
redmass: 9.0760 6.5349 4.7192 3.2679 5.0716 11.6762 5.3598 7.4820 2.4317 5.1531 4.1603 4.4767 8.7049 10.0932 10.1886 1.8241 4.3662 5.9876 4.7964 6.0211 7.1796 7.0373 4.5124 2.2195 8.2607 9.5781 7.9242 8.0206 4.5811 9.7938 4.5145 4.6744 3.6832 6.6683 8.0155 8.3358 4.0806 5.5091 12.0939 8.8086 7.8759 5.2744 4.8185 6.7782 2.5883 2.3083 1.2445 1.8438 2.9316 7.8420 1.5198 1.7223 1.6475 2.7244 3.6682 6.6290 3.2223 1.9932 6.1073 3.9430 1.6186 3.3946 2.6337 3.8224 3.4081 1.5248 2.2783 1.7328 1.2833 1.2997 5.9894 1.3562 2.5109 2.0296 1.1925 1.2653 2.1762 3.5297 2.2105 1.3386 7.6608 1.3219 1.1653 1.3822 2.9704 1.0351 1.0848 1.0876 1.0524 4.0363 1.0912 9.7069 7.0756 11.8939 1.0372 1.0565 1.0597 1.0581 1.0570 1.1061 1.1070 1.0959 1.1075 1.1025 1.1098 1.0933 1.0935 1.0755
irintensity: 0.5033 1.7039 3.5311 0.7029 5.2209 1.7232 1.3403 0.8829 1.6809 0.8340 3.2601 0.1919 5.2191 5.5083 0.1329 0.3005 6.2017 4.9525 4.7057 12.6135 3.4206 5.4874 1.4430 1.6825 4.7604 2.0601 16.6190 3.9974 8.3561 10.5810 27.3966 75.3020 4.4630 15.6671 12.6832 24.1911 14.3561 1.7676 5.6491 9.2419 6.0597 6.3282 6.1826 1.7043 90.7702 10.0702 3.3540 10.9199 17.3231 124.0504 23.5236 14.7257 26.2392 5.2585 46.8904 69.2175 72.9534 7.9888 144.9109 6.5030 7.5353 30.3483 22.1853 29.9049 18.2149 4.2785 48.1814 11.7979 7.8559 20.1865 23.6661 16.8545 8.8765 13.2144 8.9054 1.9485 76.7804 22.2804 22.2368 10.5670 6.0337 17.7180 28.1369 24.2144 42.4636 18.1113 14.1404 0.1430 12.5859 270.3963 18.0770 32.7267 5.6356 237.2417 10.5662 34.2291 10.4151 38.5522 4.1382 10.1381 5.4893 7.2741 32.0069 3.6358 4.2207 3.3389 6.3113 28.7160
temp: 298.150 k
press: 1.00000 atm
elementType: 17 16 9 9 8 8 8 7 7 7 7 7 6 6 6 6 6 6 6 6 6 6 6 6 1 1 1 1 1 1 1 1 1 1 1 1 1 1
symmnumber: 1
zpe: 691873.9 jmol-1
zpe.correction: 0.263521 hartree
zpe.thermalcorrener: 0.289177 hartree
zpe.thermalcorrenthalpy: 0.290121 hartree
zpe.thermalcorrgfe: 0.201068 hartree
zpe.sumelectzpe: -2020.896400 hartree
zpe.sumelectthermal: -2020.870743 hartree
zpe.sumelectthermalent: -2020.869799 hartree
zpe.sumelectthermalfe: -2020.958852 hartree
dipole: 2.2466 -3.1760 2.4506
dipole: 4.5978
quadrupole: -132.1226 -173.1256 -160.7866
quadrupole: 5.4002 25.9733 13.3110
quadrupole: 23.2223 -17.7807 -5.4416 5.4002 25.9733 13.3110
hfenergy: -2021.1599205 hartree
pointgroup: C01 [X(C12H14Cl1F2N5O3S1)]
dipole: -0.8141905 -1.329432 -0.9175541 debye
polarizability: 308.7136388|-10.8207894|231.1237699|-7.0130651|12.5399507|158.5327156 unknown
InChI: InChI=1S/C12H14ClF2N5O3S/c1-2-24(22,23)16-10-7-11(9(15)6-8(10)13)20-12(21)19(17-18-20)5-3-4-14/h6-7,16H,2-5H2,1H3
charge 0 multiplicity 1
38 atoms
Cl -4.803372 -2.055632 0.517079
S  -3.420896 2.145137 0.36256
F  -0.02412 -3.608728 -0.739002
F  6.420383 3.219489 -0.637291
O  -4.399431 3.074532 1.255399
O  -1.913121 2.592466 -0.030128
O  1.745327 0.186473 1.921049
N  3.227801 -0.452433 0.136329
N  1.147809 -1.089442 -0.062269
N  -3.241217 0.498874 1.383281
N  3.111602 -1.143294 -1.077474
N  1.857126 -1.536793 -1.214368
C  4.488133 0.162942 0.55693
C  -0.243012 -1.323731 0.091604
C  -2.46617 -0.525392 0.802912
C  4.818743 1.430022 -0.265789
C  -1.066731 -0.323687 0.647967
C  -4.348363 1.673108 -1.305386
C  1.998581 -0.367238 0.824169
C  -0.824842 -2.566407 -0.267885
C  -3.007915 -1.773792 0.374699
C  -2.201401 -2.803889 -0.130796
C  6.145725 2.042559 0.185373
C  -4.312196 2.870533 -2.247688
H  4.362114 0.406099 1.627782
H  5.290775 -0.590346 0.461085
H  4.881438 1.169025 -1.337415
H  4.012903 2.176198 -0.145314
H  -0.637332 0.621757 0.98738
H  -3.787822 0.795661 -1.666074
H  -5.352841 1.39334 -0.95018
H  -4.204621 0.23145 1.649599
H  -2.615467 -3.773046 -0.418742
H  6.110374 2.387438 1.235919
H  6.995432 1.348159 0.042147
H  -4.8158 2.594553 -3.193412
H  -4.840083 3.739764 -1.820304
H  -3.275115 3.162671 -2.483848
