program: Gaussian 09
title: 000183403
version: EM64L-G09RevD.01
frameworkgroup: C1[X(C16H18N4O)]
method: RPBEPBE
basis: SDD
operation: Freq
keyword: #p
keyword: freq=noraman
keyword: PBEPBE/SDD
title: #p freq=noraman PBEPBE/SDD
converged: YES YES NO NO
title: Mulliken charges:
elementType: O N N N N C C C C C C C C C C C C C C C C H H H H H H H H H H H H H H H H H H
charge: -0.325190 -0.464497 -0.351240 -0.087170 -0.057599 0.122915 0.253848 0.179459 0.229646 -0.126335 -0.388398 -0.330085 -0.305933 -0.389134 -0.369133 0.205100 -0.397669 -0.254675 -0.206166 -0.617689 -0.616001 0.368393 0.255647 0.219001 0.179980 0.245005 0.236625 0.237313 0.244875 0.338086 0.240376 0.226695 0.226711 0.233744 0.187586 0.220762 0.226564 0.188746 0.219835
chargesum: 0.00000
title: Mulliken charges with hydrogens summed into heavy atoms:
elementType: O N N N N C C C C C C C C C C C C C C C C
charge: -0.325190 -0.096104 -0.013154 -0.087170 -0.057599 0.122915 0.253848 0.179459 0.229646 -0.126335 0.086251 0.094899 -0.069308 -0.151821 -0.124257 0.205100 -0.157293 -0.027980 0.020545 0.024404 0.019145
polarizability: 3.28998515e+02 3.13767600e+01 2.26363478e+02 -1.47130105e+01 1.15620553e+01 1.07534898e+02
1716.lowfreq: -6.5881 -0.0005 0.0005 0.0009 0.8867 6.2753 18.1034 29.5935 31.7948
frequency: 17.8890 29.5908 31.7692 68.3808 84.4568 105.8584 108.6685 121.7067 175.9355 191.5340 211.3003 220.6227 227.0424 259.8288 283.0671 294.4338 318.7803 353.8237 381.9607 392.0218 415.1874 436.3520 474.1918 487.9597 502.7256 561.4799 574.1662 577.4860 609.0941 626.4504 684.7025 708.0220 720.2386 734.8497 740.7296 758.0703 766.8223 790.8191 807.4520 822.7117 833.9664 846.0599 864.4145 867.5133 885.2015 944.2572 950.1105 979.5543 998.5298 1015.4633 1022.5571 1035.9643 1055.7298 1058.6112 1076.0105 1088.7976 1094.0634 1122.1967 1138.4781 1166.7335 1179.2178 1191.8797 1214.3941 1225.9656 1250.4658 1263.5841 1273.4614 1300.1709 1303.6778 1320.1730 1324.5606 1327.4619 1348.8654 1370.5810 1404.7171 1420.2484 1425.1923 1438.5110 1440.6278 1451.8820 1458.1538 1462.7908 1467.9118 1475.7578 1480.9548 1484.8573 1486.8866 1512.7778 1565.9370 1585.7904 1595.2300 1604.1740 1641.5749 2846.2810 2848.0577 2866.4722 3018.0842 3019.6073 3025.2096 3047.1402 3078.1498 3082.3509 3091.9968 3130.3466 3138.8293 3139.9377 3153.0966 3164.2751 3167.9034 3464.6974 3497.0754
redmass: 3.8145 5.2888 2.8746 4.6182 2.4733 5.2332 4.2414 5.1274 2.9719 4.8427 2.8828 1.1435 1.4712 2.8393 4.1503 5.5752 4.6817 2.7268 8.7838 2.7180 2.6832 3.1017 3.8990 5.2424 4.0761 6.8235 3.9188 5.4117 5.2638 7.2051 5.6586 2.2951 1.5821 1.9989 1.2985 1.4435 3.3848 2.1047 3.9761 4.5349 2.9129 1.4608 1.5589 5.9784 4.2465 1.3957 1.3999 1.3166 5.2015 2.1788 2.7588 1.5701 2.5153 2.1801 1.8262 1.6474 1.9556 1.7089 1.5110 1.1485 1.7722 2.0749 1.5511 2.3838 2.2032 2.2679 1.9485 1.5552 1.5803 2.3384 1.9605 1.4582 4.1066 1.3282 3.7006 1.1404 2.5093 2.8466 1.2041 1.1349 3.6293 1.0554 1.0621 1.0511 1.0893 1.0589 3.7260 2.2370 7.7032 7.1678 6.2473 8.4019 8.3591 1.0579 1.0654 1.0614 1.0625 1.0721 1.0706 1.0878 1.1009 1.1005 1.1045 1.0853 1.0893 1.0882 1.0953 1.0975 1.1003 1.0774 1.0818
irintensity: 0.2458 1.3271 0.3489 1.9624 0.2450 4.1788 6.9749 0.3223 0.0199 0.2988 0.8388 1.8439 0.1311 1.7055 17.0839 1.4050 4.7404 10.1184 1.2763 6.3454 1.6745 11.8437 8.1737 4.8163 4.5567 6.0048 2.0578 13.6368 1.2635 23.4698 2.3586 11.4208 32.5899 2.3095 172.7764 60.4850 10.7820 15.7659 55.4100 5.4552 2.6637 13.7969 3.1632 5.8708 1.1802 2.9265 0.0137 0.1209 1.2417 10.2044 10.3503 21.0862 11.4793 35.2210 42.4196 2.1622 13.1464 24.2957 3.5669 6.6604 23.8243 21.5117 19.6066 3.9061 119.1063 3.9523 28.5611 2.1166 36.6402 3.4788 31.6411 5.0223 145.8757 2.1216 2.1540 5.5073 1.8859 50.0239 6.0840 26.0617 18.2359 11.9153 17.5286 27.0434 19.2543 6.2400 65.3261 443.1325 34.1173 11.9781 79.5336 104.5883 19.7586 72.8763 70.1899 233.6839 22.1490 36.7819 76.9767 10.1214 16.2396 64.8237 19.2937 0.1403 9.3913 3.0407 21.8098 29.8594 31.9367 46.7740 184.9970
temp: 298.150 k
press: 1.00000 atm
elementType: 8 7 7 7 7 6 6 6 6 6 6 6 6 6 6 6 6 6 6 6 6 1 1 1 1 1 1 1 1 1 1 1 1 1 1 1 1 1 1
symmnumber: 1
zpe: 830210.4 jmol-1
zpe.correction: 0.316210 hartree
zpe.thermalcorrener: 0.335001 hartree
zpe.thermalcorrenthalpy: 0.335945 hartree
zpe.thermalcorrgfe: 0.267233 hartree
zpe.sumelectzpe: -913.253528 hartree
zpe.sumelectthermal: -913.234737 hartree
zpe.sumelectthermalent: -913.233793 hartree
zpe.sumelectthermalfe: -913.302506 hartree
dipole: -0.4104 1.1434 1.2238
dipole: 1.7244
quadrupole: -99.2928 -114.0331 -129.1327
quadrupole: 3.8026 1.8781 -0.2416
quadrupole: 14.8601 0.1198 -14.9798 3.8026 1.8781 -0.2416
hfenergy: -913.5697382 hartree
pointgroup: C01 [X(C16H18N4O1)]
dipole: 0.1456407 0.5703811 -0.3372271 debye
polarizability: 328.1067431|-24.0203698|222.4319147|-29.3649048|23.244302|112.3582321 unknown
InChI: InChI=1S/C16H18N4O/c1-20(2)10-9-18-16(21)15-14-12(7-8-17-15)11-5-3-4-6-13(11)19-14/h3-8,18-19H,9-10H2,1-2H3
charge 0 multiplicity 1
39 atoms
O  -1.312221 -1.265627 0.441613
N  1.429813 -1.001183 0.002012
N  -2.555471 0.668396 0.91833
N  -5.896473 -0.802901 -0.159365
N  -0.326653 2.231035 0.699678
C  1.07666 0.323444 0.223712
C  2.246845 1.157254 0.116567
C  3.357136 0.263297 -0.188491
C  2.808739 -1.070047 -0.251494
C  -0.186568 0.883353 0.513443
C  -3.851259 -0.007133 1.051941
C  -4.562786 -0.183704 -0.315973
C  2.080832 2.545673 0.313235
C  4.740862 0.460163 -0.411423
C  3.61675 -2.192554 -0.530775
C  -1.396524 0.003973 0.618904
C  0.779988 3.029113 0.60072
C  5.551582 -0.65868 -0.691104
C  4.992382 -1.968064 -0.749079
C  -6.326201 -1.565984 -1.348459
C  -6.931371 0.149431 0.289597
H  0.720274 -1.740919 0.038626
H  -3.688548 -1.007391 1.487454
H  -4.479871 0.57687 1.747437
H  -4.612888 0.80596 -0.838884
H  -3.932596 -0.848087 -0.933759
H  2.920187 3.245054 0.249161
H  5.177305 1.464108 -0.367864
H  3.195453 -3.201835 -0.577281
H  -2.457735 1.686806 1.014932
H  0.609232 4.098835 0.75952
H  6.624247 -0.52516 -0.866419
H  5.645775 -2.81992 -0.968423
H  -5.567176 -2.328947 -1.594438
H  -6.487335 -0.929332 -2.255683
H  -7.275405 -2.08814 -1.129391
H  -7.874199 -0.392113 0.48476
H  -7.141932 0.953623 -0.461963
H  -6.626551 0.636833 1.232026
