program: Gaussian 09
title: 000183357
version: EM64L-G09RevD.01
frameworkgroup: C1[X(C9H6ClNO5)]
method: RPBEPBE
basis: SDD
operation: Freq
keyword: #p
keyword: freq=noraman
keyword: PBEPBE/SDD
title: #p freq=noraman PBEPBE/SDD
converged: NO YES NO NO
title: Mulliken charges:
elementType: Cl O O O O O N C C C C C C C C C H H H H H H
charge: -0.030353 -0.394267 -0.414646 -0.319077 -0.215000 -0.218812 0.096979 0.386613 0.006259 0.116259 -0.312913 -0.300483 -0.125738 -0.228910 0.185393 -0.192131 0.260978 0.301697 0.321880 0.269519 0.403742 0.403010
chargesum: 0.00000
title: Mulliken charges with hydrogens summed into heavy atoms:
elementType: Cl O O O O O N C C C C C C C C C
charge: -0.030353 0.009475 -0.011636 -0.319077 -0.215000 -0.218812 0.096979 0.386613 0.006259 0.116259 -0.051935 0.001214 -0.125738 0.092970 0.185393 0.077388
polarizability: 2.59108077e+02 -6.44359218e+00 1.71052869e+02 1.26688854e-02 -4.45069084e-02 4.95297329e+01
1716.lowfreq: -0.0021 -0.0008 0.0005 4.7259 7.9603 8.5226 34.3403 55.1007 71.5641
frequency: 34.2765 55.0929 71.5623 91.7009 136.5538 145.0864 155.3615 162.2767 212.0880 254.3217 257.9483 319.9732 353.4385 360.8097 374.3827 437.7671 482.3423 499.0789 548.6207 573.6941 597.3125 602.3538 633.4608 658.0236 689.0895 708.8387 764.1524 781.6920 853.0547 857.6479 867.8876 898.2164 920.1947 936.9668 951.2432 1023.1826 1063.5158 1103.9004 1184.9914 1202.3313 1220.5926 1245.6877 1274.6571 1284.8090 1326.4544 1383.6345 1388.7831 1407.7622 1423.0654 1436.0589 1562.4948 1588.1767 1627.3949 1634.4128 2975.6567 3145.0117 3166.8033 3186.5243 3194.6409 3531.1127
redmass: 9.4764 9.2700 12.3545 10.8346 5.7647 7.2009 12.7049 3.5693 9.3778 9.6438 3.8647 6.9328 14.9933 5.5296 7.8370 10.0316 3.4453 6.7869 3.4159 6.5141 1.2621 5.2660 5.4226 5.6877 8.7633 6.8564 6.9124 5.5169 8.1085 1.7620 1.0799 1.6112 1.4085 7.2164 5.0839 1.2174 2.5647 1.7245 2.0661 2.8347 2.0435 2.1046 2.2790 1.7202 2.1253 5.7445 4.2380 2.3962 5.0331 4.6168 6.3115 5.5021 4.7099 5.7744 1.0694 1.0896 1.0926 1.0934 1.0949 1.0644
irintensity: 0.0650 0.0249 1.3379 1.8867 3.2009 0.2760 0.3089 0.0113 3.1335 0.9195 1.1306 1.4594 0.3129 4.6188 13.5635 5.5870 0.2542 4.7945 15.8656 60.0020 152.8332 14.8234 57.1757 1.9004 4.2057 6.1040 43.6984 10.1929 25.8782 53.0286 138.7470 13.6649 5.0354 44.0109 9.4796 48.6679 409.5989 139.0326 58.9985 283.9260 154.0283 0.3781 5.1740 62.7418 185.1488 101.7991 9.9455 294.7793 64.0512 140.5162 118.5455 45.6263 114.3720 162.4281 445.3827 7.7543 0.1111 7.4991 11.0172 102.9808
temp: 298.150 k
press: 1.00000 atm
elementType: 17 8 8 8 8 8 7 6 6 6 6 6 6 6 6 6 1 1 1 1 1 1
symmnumber: 1
zpe: 369814.6 jmol-1
zpe.correction: 0.140855 hartree
zpe.thermalcorrener: 0.155146 hartree
zpe.thermalcorrenthalpy: 0.156090 hartree
zpe.thermalcorrgfe: 0.097964 hartree
zpe.sumelectzpe: -1236.263270 hartree
zpe.sumelectthermal: -1236.248979 hartree
zpe.sumelectthermalent: -1236.248035 hartree
zpe.sumelectthermalfe: -1236.306160 hartree
dipole: 7.5817 0.6885 0.0010
dipole: 7.6129
quadrupole: -115.3900 -103.6118 -98.4126
quadrupole: -13.2763 0.0036 -0.0072
quadrupole: -9.5852 2.1930 7.3922 -13.2763 0.0036 -0.0072
hfenergy: -1236.4041246 hartree
pointgroup: C01 [X(C9H6Cl1N1O5)]
dipole: 2.9492061 0.5174493 0.0735878 debye
dipolederiv: -0.1000514 -0.105671 -0.0039848 -0.1923098 -0.7718823 -0.0242737 -0.0063952 -0.0225376 -0.0492605 -0.3592478 -0.0051612 0.0003118 0.2141389 -1.2228844 -0.0191323 0.0059914 -0.0234836 -0.3675585 -1.5709742 -0.076461 -0.02523 -0.3138264 -0.2632461 -0.0020716 -0.0336735 0.0024146 -0.4084874 -0.8091804 0.1417675 -0.005238 0.2517537 -1.1287711 -0.0178758 -0.0019447 -0.0184948 -0.3480923 -1.0350329 0.1868747 -0.0114535 0.1488203 -0.5303257 -0.0042115 -0.0125641 -0.0036388 -0.2440613 -0.6209085 -0.0919766 -0.0104005 -0.3803244 -0.8009147 -0.0225346 -0.0178333 -0.0164606 -0.2271565 2.094521 0.0754222 0.0408806 0.646007 1.1379101 0.0374835 0.0561035 0.0258724 0.1919994 -0.3719585 0.0985864 -0.0042471 -0.5207854 -0.2897505 -0.0176943 -0.0207506 -0.0051586 -0.0231863 0.1349192 -0.0444237 -0.0005096 -0.1823693 1.0425798 0.0223649 -0.0029748 0.0246574 0.0808547 -0.5369629 0.1730151 -0.0050147 0.7159316 -0.5452864 -0.0004775 0.0102893 -0.0113923 -0.0224246 0.3354289 -0.0622084 0.0053703 0.4499999 -0.1319573 0.0063973 0.0190267 -0.0039545 -0.0404692 0.1496908 -0.0261747 0.0027568 -0.8442556 -0.0124571 -0.0161484 -0.020518 -0.0001293 -0.0327476 -0.7844646 0.2470375 -0.0066491 0.5187287 1.2107816 0.0472187 0.0017012 0.0418969 -0.0920094 1.1128302 0.1360449 0.0266773 0.0770477 -0.0331246 0.0011742 0.0248627 0.0025547 -0.0233724 2.2813754 -0.3853265 0.0292418 -0.4360372 1.3467873 0.0226341 0.0288842 0.0228617 0.2705335 -1.3019339 -0.2381073 -0.0298397 -0.0029924 0.0864799 0.0054587 -0.0235816 0.0008047 -0.135236 0.0351598 0.0742123 0.000051 0.0532682 0.0736877 -0.0009719 -0.0007135 -0.0006125 0.1439981 0.0952784 -0.0352015 -0.0022486 -0.0274887 0.1191521 -0.0017924 -0.0020016 -0.0019793 0.1635558 0.1401826 -0.0056134 -0.0008391 -0.0379546 0.0874186 -0.0030425 -0.0021761 -0.0025019 0.1755596 0.0658281 -0.0176926 -0.003288 -0.0852147 -0.0006538 -0.0068751 -0.0048797 -0.0055334 0.2014162 0.5881529 -0.0459043 0.0026498 -0.1313705 0.4696368 0.0000004 0.0000356 0.0018503 0.3747012 0.4573478 0.0069614 0.0010032 0.0792331 0.1568201 -0.0056304 0.003112 -0.0070353 0.4114435 unknown
polarizability: 259.4825046|0.8651725|170.501|4.2191811|3.3655275|49.7071739 unknown
InChI: InChI=1S/C9H6ClNO5/c10-6-3-5(1-2-11(15)16)8(12)7(4-6)9(13)14/h1-4,12-13H
charge 0 multiplicity 1
22 atoms
Cl 1.462666 3.858555 0.169343
O  0.450733 -2.062233 -0.015799
O  4.424278 -0.605875 0.102189
O  2.999262 -2.429656 0.021866
O  -5.254885 0.396235 -0.064941
O  -4.239222 -1.657559 -0.096888
N  -4.204043 -0.365629 -0.063259
C  -0.404434 0.187648 0.029228
C  0.711449 -0.71672 0.025808
C  2.052635 -0.202257 0.065783
C  -0.141248 1.581622 0.073731
C  2.280916 1.19704 0.109743
C  1.179906 2.064115 0.113082
C  -1.751336 -0.379334 -0.012974
C  3.162035 -1.164641 0.059401
C  -2.916843 0.325687 -0.01892
H  -0.970556 2.295005 0.078199
H  3.306048 1.573962 0.139823
H  -1.821851 -1.473667 -0.042654
H  -3.040593 1.40959 0.00607
H  1.338449 -2.572578 -0.011729
H  5.113034 -1.323911 0.096501
