program: Gaussian 09
title: 000183356
version: EM64L-G09RevD.01
frameworkgroup: C1[X(C8H5ClO4)]
method: RPBEPBE
basis: SDD
operation: Freq
keyword: #p
keyword: freq=noraman
keyword: PBEPBE/SDD
title: #p freq=noraman PBEPBE/SDD
converged: NO YES NO NO
title: Mulliken charges:
elementType: Cl O O O O C C C C C C C C H H H H H
charge: -0.033740 -0.394950 -0.415351 -0.323234 -0.207241 0.136959 0.030628 0.277242 -0.280558 -0.306309 -0.105341 0.185301 -0.195396 0.299899 0.304384 0.226886 0.399736 0.401085
chargesum: 0.00000
title: Mulliken charges with hydrogens summed into heavy atoms:
elementType: Cl O O O O C C C C C C C C
charge: -0.033740 0.004786 -0.014266 -0.323234 -0.207241 0.136959 0.030628 0.277242 0.019341 -0.001925 -0.105341 0.185301 0.031490
polarizability: 1.57790811e+02 4.29260568e+00 1.44353271e+02 7.55761424e-03 1.72658485e-03 4.15237203e+01
1716.lowfreq: -5.3677 -4.5714 -0.0017 -0.0013 0.0016 4.8319 67.0683 106.4785 140.0089
frequency: 67.0668 106.4774 140.0086 153.4186 164.8875 169.4515 202.9483 308.6455 340.1935 348.4359 355.3118 379.8059 441.9634 464.7534 542.6015 555.6525 595.3309 608.8404 666.2402 692.8993 773.8991 775.3083 850.8002 869.3336 915.1979 918.0088 941.1308 998.2856 1058.5623 1096.8859 1182.3571 1224.9101 1251.7014 1306.2492 1364.9483 1396.9020 1399.0415 1415.0599 1440.5379 1558.2090 1579.2630 1604.7981 1634.6987 2976.9607 2980.0177 3157.6286 3183.8066 3529.0782
redmass: 9.6738 13.1551 8.3486 14.0149 8.8926 4.0976 3.0065 6.3295 11.5386 6.2837 15.6591 6.9093 10.0615 3.4854 3.6184 6.2834 1.2296 4.9867 6.3258 6.1771 5.9503 6.4778 8.1966 1.0758 1.5017 6.5279 1.3629 1.7771 2.6855 1.6942 1.7645 2.1895 3.8689 1.6822 1.9250 3.0524 4.3103 2.5821 4.3718 5.7516 6.8616 5.7660 4.8355 1.0880 1.0693 1.0925 1.0932 1.0643
irintensity: 0.0295 1.6577 0.0755 2.4554 1.5414 12.6089 4.8481 0.2498 1.7036 5.5124 2.2978 18.1193 4.0700 0.7305 9.3059 35.4026 162.7562 95.4643 19.9921 4.0028 15.5965 21.3612 21.5483 160.9950 17.8924 2.7618 0.0824 8.4510 380.4959 97.4509 74.5736 34.7984 17.8742 98.4165 36.9929 63.3076 111.0425 227.0721 202.5009 86.0088 211.4834 33.9788 177.9552 44.5990 352.6490 6.2736 3.8285 88.4032
temp: 298.150 k
press: 1.00000 atm
elementType: 17 8 8 8 8 6 6 6 6 6 6 6 6 1 1 1 1 1
symmnumber: 1
zpe: 303184.6 jmol-1
zpe.correction: 0.115477 hartree
zpe.thermalcorrener: 0.126851 hartree
zpe.thermalcorrenthalpy: 0.127796 hartree
zpe.thermalcorrgfe: 0.077558 hartree
zpe.sumelectzpe: -1067.890057 hartree
zpe.sumelectthermal: -1067.878683 hartree
zpe.sumelectthermalent: -1067.877739 hartree
zpe.sumelectthermalfe: -1067.927976 hartree
dipole: -4.1730 -2.7679 -0.0012
dipole: 5.0075
quadrupole: -81.6475 -87.7460 -81.2485
quadrupole: 1.0932 -0.0073 -0.0077
quadrupole: 1.8998 -4.1987 2.2988 1.0932 -0.0073 -0.0077
hfenergy: -1068.0055344 hartree
pointgroup: C01 [X(C8H5Cl1O4)]
dipole: 1.9400752 0.3391599 0.0485521 debye
dipolederiv: -0.1289862 0.169523 -0.0038097 0.185412 -0.7758272 0.0125323 -0.0039672 0.0121583 -0.0531426 -0.5187873 0.3105176 -0.0070849 0.3259319 -1.1393909 0.0164081 -0.0073638 0.0160126 -0.375704 -1.1244107 -0.4481348 -0.0147083 -0.7027429 -0.6036851 -0.0172129 -0.0125011 -0.0104859 -0.4090318 -0.9371142 0.2471103 -0.0185639 0.2752562 -0.9794678 0.0140365 -0.0193253 0.0137518 -0.3519343 -1.1527131 -0.3506447 -0.0185852 -0.002806 -0.3969854 0.0006198 -0.0214773 -0.0086045 -0.3323612 -0.8870192 0.028848 -0.0235656 0.4640898 -0.3306787 0.0156042 -0.0279123 0.0038377 -0.0366551 0.3908145 -0.3294665 0.0112953 -0.2752651 0.9815194 -0.016248 0.0106605 -0.0180384 0.0968899 -0.4324337 0.0191271 -0.0111462 -0.5774153 -0.6634662 -0.0088571 -0.0052241 0.0070528 -0.0226686 0.3965446 0.1032661 0.0101126 -0.4675301 -0.1624191 -0.011128 0.0160121 0.0042495 -0.0205759 0.1233337 -0.0114686 0.003865 0.5132141 0.0424045 0.0133172 -0.0015418 -0.00084 -0.0161685 -0.5559017 -0.4282819 -0.0077562 -0.4693252 1.1812187 -0.026059 -0.0072159 -0.0249594 -0.1052485 2.2554155 -0.034386 0.054733 0.0686408 1.2256226 -0.0082737 0.0542491 -0.0112118 0.2697576 1.411828 0.5171523 0.0292086 0.5435056 0.8604209 0.0069499 0.0286904 0.006191 0.1277819 0.1101466 -0.0424207 -0.0009289 -0.032126 0.0858246 -0.0000849 -0.001011 -0.0003831 0.1616328 0.0835873 0.0599164 -0.0025015 0.0116312 0.1355334 0.0004943 -0.0020664 0.0017873 0.1537557 0.0512203 0.091766 -0.0029444 -0.0019086 -0.1360532 0.0026726 -0.0020567 0.0053487 0.1267542 0.5625733 0.0039345 0.0050852 -0.0284018 0.4432622 -0.0013851 0.0055735 -0.0003815 0.3764138 0.3519023 0.093642 -0.0027049 0.1698396 0.2321674 0.006614 -0.0035228 0.0045149 0.4105045 unknown
polarizability: 158.6970101|-1.9951947|143.3494715|3.1870356|-1.1083553|41.6213205 unknown
InChI: InChI=1S/C8H5ClO4/c9-5-1-4(3-10)7(11)6(2-5)8(12)13/h1-3,11-12H
charge 0 multiplicity 1
18 atoms
Cl -1.147008 3.57264 -0.03644
O  0.348372 -2.259802 0.063615
O  3.377667 0.705455 0.116355
O  2.823609 -1.543263 0.125158
O  -3.643968 -1.27906 -0.052655
C  1.04885 0.099522 0.058246
C  0.035311 -0.922369 0.041438
C  -1.340615 -0.541387 0.000633
C  0.679312 1.469731 0.034269
C  -1.685303 0.831274 -0.022422
C  -0.679602 1.813902 -0.005519
C  2.452916 -0.321304 0.101364
C  -2.416134 -1.569164 -0.017796
H  1.460484 2.234038 0.047353
H  -2.749553 1.089194 -0.053588
H  -2.070352 -2.624784 0.003092
H  1.366968 -2.357375 0.092572
H  4.297746 0.327751 0.146224
