program: Gaussian 09
title: 000183352
version: EM64L-G09RevD.01
frameworkgroup: C1[X(C14H16N2)]
method: RPBEPBE
basis: SDD
operation: Freq
keyword: #pfreq=noraman
keyword: PBEPBE/SDD
title: #p freq=noraman PBEPBE/SDD
converged: YES YES NO NO
title: Mulliken charges:
elementType: N N C C C C C C C C C C C C C C H H H H H H H H H H H H H H H H
charge: -0.481184 -0.083024 -0.390880 -0.394508 -0.400944 -0.581358 -0.592985 0.563305 -0.570535 0.225828 0.261075 0.022074 -0.362614 -0.353735 -0.217543 -0.231257 0.187753 0.210269 0.204220 0.206201 0.209350 0.206722 0.207026 0.212484 0.306369 0.194796 0.217754 0.302118 0.230550 0.247054 0.222052 0.223569
chargesum: 0.00000
title: Mulliken charges with hydrogens summed into heavy atoms:
elementType: N N C C C C C C C C C C C C C C
charge: -0.179066 -0.083024 0.007142 0.015912 0.015128 -0.161848 -0.091820 0.563305 -0.352781 0.225828 0.261075 0.022074 -0.132065 -0.106681 0.004509 -0.007688
polarizability: 3.01903078e+02 6.85638209e+00 1.56795813e+02 1.00503049e+01 -4.87264122e+00 8.95581412e+01
1716.lowfreq: -9.0711 -7.1149 -0.0008 -0.0002 0.0005 7.2642 35.1055 45.2226 83.2951
frequency: 34.6802 45.0567 83.2621 92.0930 171.4227 214.5463 239.6689 251.6422 289.4467 324.4893 371.9308 414.2918 428.8633 446.4397 472.6463 475.6368 558.4621 577.0913 586.1986 613.2652 642.3718 705.9550 732.7394 750.5417 766.0826 771.3962 786.2514 831.7114 848.0662 851.9498 853.9047 868.3408 884.4867 908.4159 930.7841 931.8287 971.9733 972.4904 991.2112 1008.1245 1038.8184 1083.6139 1092.9619 1103.1308 1111.0665 1124.4247 1158.0974 1162.6537 1204.9333 1219.4770 1235.0790 1251.3794 1256.9405 1271.6619 1293.8453 1308.5221 1316.1204 1324.4050 1333.7111 1342.2329 1347.7131 1404.3376 1413.2714 1437.3992 1457.4605 1463.6382 1465.3799 1474.8963 1475.2605 1479.1885 1511.1094 1590.8217 1631.2250 1662.2108 2945.2703 2950.8827 2965.3625 2975.5616 2979.7660 3027.3377 3030.1220 3037.8299 3046.5471 3074.7720 3077.4344 3128.1881 3140.0254 3156.1184 3169.6865 3595.6156
redmass: 4.3000 3.4696 4.0182 4.0751 2.5553 3.7921 3.8374 4.5987 2.3967 2.4409 3.0408 2.8070 3.3297 3.1277 2.2156 2.9284 5.1575 2.4437 1.3892 6.7190 2.5442 4.5763 5.0682 1.3608 3.6685 3.4908 1.4968 3.6585 1.3905 1.5408 3.1416 1.5718 4.9602 2.7752 1.3824 1.3585 3.7597 1.3138 3.0896 2.1900 2.0361 1.1673 1.5382 1.9378 1.5778 1.9420 1.2331 1.4062 1.5356 2.6982 1.4133 1.3220 1.5342 2.2178 2.1169 1.3547 1.4045 1.8175 1.5639 1.5514 1.4672 1.6340 2.7557 3.6779 1.1017 1.0871 1.0928 1.1184 3.2149 1.1129 4.6175 6.8288 7.3922 7.4896 1.0665 1.0651 1.0622 1.0621 1.0616 1.0972 1.0947 1.1028 1.1037 1.0932 1.0888 1.0852 1.0904 1.0955 1.0993 1.0811
irintensity: 3.1141 0.0451 0.6125 0.6946 0.8957 1.4398 0.9048 5.4235 0.5114 0.5682 0.3906 0.3231 3.3938 9.3531 0.1620 3.2120 4.4192 18.9666 65.0375 1.4692 9.7244 8.0871 0.8166 107.4425 5.7013 1.4079 0.3804 4.4219 28.0888 0.2510 2.0117 18.3344 1.5922 4.9931 3.3860 8.0002 2.8308 0.0720 10.0761 16.3438 2.3766 0.5473 0.3597 0.4243 3.6674 0.5628 2.0414 14.5175 0.5322 4.8569 7.3770 18.5625 34.1814 14.0542 14.1024 2.6562 12.6773 37.8882 9.8873 5.7880 4.9949 4.6574 9.5892 21.0697 10.1367 6.1417 8.4315 21.8059 5.8875 1.9845 43.5648 8.6489 1.9087 122.4058 9.7992 63.4353 44.0379 43.4707 33.2354 77.4811 62.7078 12.8698 106.5180 9.3955 26.2664 0.0475 13.3162 29.7879 25.8044 35.0837
temp: 298.150 k
press: 1.00000 atm
elementType: 7 7 6 6 6 6 6 6 6 6 6 6 6 6 6 6 1 1 1 1 1 1 1 1 1 1 1 1 1 1 1 1
symmnumber: 1
zpe: 706079.5 jmol-1
zpe.correction: 0.268931 hartree
zpe.thermalcorrener: 0.282103 hartree
zpe.thermalcorrenthalpy: 0.283047 hartree
zpe.thermalcorrgfe: 0.228373 hartree
zpe.sumelectzpe: -651.448813 hartree
zpe.sumelectthermal: -651.435642 hartree
zpe.sumelectthermalent: -651.434698 hartree
zpe.sumelectthermalfe: -651.489371 hartree
dipole: -1.0655 -2.9232 0.3710
dipole: 3.1334
quadrupole: -83.9686 -83.9691 -99.6297
quadrupole: -2.7419 1.8156 -1.4054
quadrupole: 5.2205 5.2200 -10.4406 -2.7419 1.8156 -1.4054
hfenergy: -651.7177446 hartree
pointgroup: C01 [X(C14H16N2)]
dipole: -0.4479796 -1.1442287 0.0987402 debye
polarizability: 302.0961537|2.8422122|156.8478794|10.6469748|-2.4032333|89.3129995 unknown
InChI: InChI=1S/C14H16N2/c1-2-6-11(7-3-1)10-14-15-12-8-4-5-9-13(12)16-14/h4-5,8-10,15H,1-3,6-7H2
charge 0 multiplicity 1
32 atoms
N  1.271751 -1.566681 0.08919
N  0.668793 0.625571 -0.125914
C  -4.773755 1.012249 0.454494
C  -4.65198 -0.519072 0.633927
C  -3.387674 1.693069 0.530617
C  -3.662225 -1.12674 -0.402399
C  -2.388178 1.085818 -0.497223
C  -2.315108 -0.423361 -0.353815
C  -1.161596 -1.141842 -0.166871
C  0.207781 -0.649039 -0.077009
C  2.468433 -0.844338 0.148166
C  2.066762 0.531718 0.011031
C  3.816248 -1.228484 0.300522
C  3.045119 1.55332 0.028554
C  4.775368 -0.191913 0.31459
C  4.395404 1.176444 0.181062
H  -5.234754 1.228458 -0.532024
H  -5.450763 1.432379 1.223501
H  -5.642179 -1.003357 0.52913
H  -4.286318 -0.740759 1.65682
H  -2.972413 1.571795 1.551148
H  -3.481199 2.780766 0.348298
H  -4.10264 -0.993477 -1.414333
H  -3.549917 -2.214836 -0.236005
H  -1.38859 1.535715 -0.392968
H  -2.761156 1.320202 -1.518438
H  -1.255679 -2.234516 -0.072093
H  1.171605 -2.578136 0.150989
H  4.117406 -2.276412 0.404041
H  2.748623 2.601491 -0.074653
H  5.835287 -0.443994 0.43077
H  5.172646 1.948362 0.197599
