program: Gaussian 09
title: 000183348
version: EM64L-G09RevD.01
frameworkgroup: C1[X(C13H10O3)]
method: RPBEPBE
basis: SDD
operation: Freq
keyword: #pfreq=noraman
keyword: PBEPBE/SDD
title: #p freq=noraman PBEPBE/SDD
converged: NO YES NO NO
title: Mulliken charges:
elementType: O O O C C C C C C C C C C C C C H H H H H H H H H H
charge: -0.298339 -0.231151 -0.421654 0.146940 -0.168272 -0.230721 -0.289463 -0.333390 0.401473 -0.093425 -0.433531 0.030364 -0.029036 -0.021415 0.033214 -0.757435 0.247869 0.268386 0.264127 0.274719 0.254748 0.362868 0.257535 0.255808 0.254928 0.254854
chargesum: 0.00000
title: Mulliken charges with hydrogens summed into heavy atoms:
elementType: O O O C C C C C C C C C C C C C
charge: -0.298339 -0.231151 -0.058785 0.146940 0.079596 0.037664 -0.025336 -0.058671 0.401473 0.161323 -0.175996 0.030364 -0.029036 -0.021415 0.033214 0.008155
polarizability: 4.05954166e+02 -7.57892502e+00 1.00552025e+02 1.49417412e+00 -7.29271009e+00 9.92443096e+01
1716.lowfreq: -29.0658 -8.5012 -0.0007 -0.0006 -0.0005 3.5952 8.7414 28.3404 33.0223
frequency: -28.9282 27.8794 32.9324 68.3809 78.8363 122.7488 153.7200 167.7365 200.7873 261.1861 275.3195 290.4217 295.8587 335.5244 355.7753 406.0654 420.9747 445.8008 476.8734 493.2961 494.8973 503.9032 558.9447 615.4588 646.1046 694.1665 714.2300 746.1578 766.6211 794.1217 808.2181 838.9762 870.3123 891.0482 899.9167 942.5370 956.0141 976.7513 1010.8102 1021.6651 1023.8852 1030.7391 1051.1112 1086.1246 1117.8635 1140.4337 1162.2029 1236.0109 1250.3633 1289.6072 1297.0508 1323.2799 1377.8227 1392.0767 1403.3924 1454.8142 1455.9953 1565.1999 1610.3754 1632.8046 2162.6626 2271.1177 2968.3973 3033.4364 3055.1795 3058.1106 3112.7427 3205.8263 3209.6460 3231.5619 3242.3431 3526.0950
redmass: 1.0187 5.4900 4.8540 5.0947 5.8039 5.1791 4.7577 4.7159 5.4717 4.6305 4.2511 3.8143 3.3541 3.3209 4.4363 1.9947 4.3670 4.6489 5.1339 8.7174 9.5289 5.1536 4.9925 3.4249 5.0680 3.6259 3.2409 1.9919 2.1727 3.1016 4.4967 1.4940 6.3500 1.4557 4.3196 1.3398 3.5728 2.8438 3.7569 1.3799 1.3961 3.5799 2.7272 1.9045 1.4112 1.9998 1.8429 1.3224 1.3354 1.6404 2.2946 2.9170 1.1901 2.0072 1.6901 1.0411 1.0409 6.8625 6.2028 9.3496 11.8162 11.8371 1.0349 1.0848 1.0982 1.0981 1.0876 1.0893 1.0883 1.1080 1.1113 1.0650
irintensity: 0.0198 1.0032 1.1670 1.3426 0.7719 5.8849 3.3352 5.3411 3.4226 8.0853 9.9651 3.4162 24.9188 8.4040 27.6967 111.2861 29.9131 6.5969 7.2348 4.9716 0.9003 35.0257 19.3149 25.3365 10.8603 15.4922 22.9229 39.4332 136.0600 87.6981 37.9006 27.5389 233.2488 15.5704 134.6451 1.2475 54.4977 107.6343 86.3856 5.8643 3.2633 97.7367 36.6823 85.4148 102.2196 4.0259 101.7610 29.6111 0.3759 48.2045 72.4243 0.2666 36.7654 1.7804 3.3532 14.4875 12.9651 49.1585 117.6504 17.6740 3.3952 20.7205 49.5395 17.7719 10.8183 10.2341 15.4634 2.3724 2.3227 0.1993 6.7272 11.7998
temp: 298.150 k
press: 1.00000 atm
elementType: 8 8 8 6 6 6 6 6 6 6 6 6 6 6 6 6 1 1 1 1 1 1 1 1 1 1
symmnumber: 1
zpe: 494292.4 jmol-1
zpe.correction: 0.188266 hartree
zpe.thermalcorrener: 0.202984 hartree
zpe.thermalcorrenthalpy: 0.203929 hartree
zpe.thermalcorrgfe: 0.145191 hartree
zpe.sumelectzpe: -725.753473 hartree
zpe.sumelectthermal: -725.738755 hartree
zpe.sumelectthermalent: -725.737811 hartree
zpe.sumelectthermalfe: -725.796548 hartree
dipole: -0.8425 -1.4101 0.8760
dipole: 1.8616
quadrupole: -56.7772 -95.5836 -90.6229
quadrupole: -1.3275 -5.6891 -7.7743
quadrupole: 24.2174 -14.5890 -9.6284 -1.3275 -5.6891 -7.7743
hfenergy: -725.9417392 hartree
pointgroup: C01 [X(C13H10O3)]
dipole: 0.3263149 -0.6055834 -0.251388 debye
dipolederiv: -2.100182 -0.0015765 -0.0403234 -0.0571304 -0.3708012 -0.0559311 -0.2140666 -0.1357456 -0.3606272 -1.7533789 0.2648512 -0.1090524 -0.1103117 -0.4496851 0.1313076 0.8239749 0.0232029 -0.2906311 -0.6128658 -0.073124 0.156727 0.1592435 -0.7470626 0.1535411 0.057039 0.0580824 -0.2470103 1.7566849 0.1473595 -0.0213752 0.9004575 0.2838093 -0.0481057 -0.5597507 0.0032856 0.3763141 0.1647963 0.2371657 -0.1897641 -0.1428629 0.5882229 -0.0499602 0.2666479 0.0095606 0.3353428 -0.4519947 -0.1049216 -0.0602624 -0.0864142 -0.0916764 0.093349 -0.2211599 0.1240994 -0.1632607 -0.3188475 -0.1789324 0.0435065 0.3270756 -0.3914433 -0.0048013 -0.3801707 0.0695113 -0.3070201 0.1544022 0.058718 0.0258015 0.5027033 0.0039765 0.1025721 0.4994539 0.0939459 -0.0089681 1.6061705 0.0370893 0.0742287 -0.4918392 0.125785 0.0321757 -0.3791676 0.0357936 0.1253252 1.0544617 -0.3746767 0.0836521 -0.6879363 0.2838498 -0.233261 0.1161009 -0.1746206 0.1659739 -0.023425 0.0416548 0.0084924 -0.2930943 -0.0734163 0.0830007 -0.2399887 0.1024972 -0.0847886 0.0551242 -0.0535605 -0.0446195 0.0119894 -0.0902889 -0.0403268 0.0222657 -0.0391308 -0.0851103 0.2090624 -0.0205984 -0.0277635 -0.0068114 -0.030976 0.019821 -0.0197771 0.0183927 -0.0340016 -0.3148516 -0.0059823 -0.0017856 0.0390819 -0.0257125 -0.0076217 0.0423258 -0.0068907 -0.0243847 0.3361632 -0.0551284 -0.058811 -0.1043392 -0.1321994 0.0137435 -0.1063463 0.012962 -0.1323212 -0.0378426 0.0163055 0.0170466 0.0760053 0.0899405 0.0010367 0.0794381 0.0021128 0.0891898 0.0884377 -0.0375751 0.0502447 -0.0386949 0.0075038 -0.0402716 -0.0022042 -0.0538767 -0.0952078 0.0701862 -0.0307105 -0.026015 0.0036975 0.0810336 -0.0775797 -0.0221325 -0.0808913 0.101019 -0.0501834 0.0718495 0.0180325 0.0752132 0.1428201 0.0281931 0.0553615 0.0438479 0.1440487 0.0341838 0.0557194 0.0453321 0.0246339 0.1207422 -0.0536238 0.0313012 -0.0531934 0.1318783 -0.020561 0.0056804 0.0586531 0.0221451 0.1362981 0.0695985 0.1075589 0.0754788 0.0680651 0.4265776 -0.0646667 -0.0667334 -0.2323712 0.352305 -0.0247966 -0.0512108 -0.0370774 0.0896989 -0.0131744 0.0500636 0.0482148 0.0733008 0.0855831 -0.0851992 0.0595338 -0.084142 0.1046958 -0.0982617 -0.044236 -0.0401526 -0.074733 0.0505607 -0.0799398 -0.0704095 -0.0803957 0.0592488 -0.0799084 0.0095041 0.0480718 -0.0040162 0.1219239 0.0349613 0.1144339 0.0301934 -0.0759617 -0.0807739 0.0497279 0.0086542 0.1150082 -0.071093 0.0381183 -0.0090512 0.0429976 0.118493 unknown
polarizability: 406.0704058|4.1544379|102.6318221|2.6306004|6.7619822|97.0482728 unknown
InChI: InChI=1S/C13H10O3/c1-2-3-4-5-6-11-7-9-13(16-11)12(14)8-10-15-13/h6-10,12,14H,1H3
charge 0 multiplicity 1
26 atoms
O  -1.492493 0.486135 0.480018
O  -3.179219 -1.212632 0.721502
O  -3.009369 1.832337 -1.268546
C  -2.406325 -0.417965 -0.273702
C  -3.48005 0.478624 -1.02555
C  -1.484015 -1.301341 -1.066435
C  -4.702854 0.340568 -0.127951
C  -0.184616 -0.977955 -0.794546
C  -0.155859 0.119249 0.169188
C  -4.470104 -0.619534 0.79749
C  0.896095 0.783486 0.759317
C  2.253296 0.504662 0.486301
C  3.467861 0.300284 0.280149
C  4.79546 0.071589 0.046647
C  6.003531 -0.133691 -0.164593
C  7.427179 -0.374971 -0.412681
H  -3.665956 0.075046 -2.036711
H  -1.858109 -2.081516 -1.728344
H  -5.61803 0.914114 -0.264164
H  0.714985 -1.437426 -1.202417
H  -5.095946 -1.032968 1.587883
H  -2.583092 2.158901 -0.432428
H  0.659059 1.574983 1.482426
H  8.057048 0.286469 0.211157
H  7.686913 -0.186529 -1.471407
H  7.703011 -1.420618 -0.179503
