program: Gaussian 09
title: 000183398
version: EM64L-G09RevD.01
frameworkgroup: C1[X(C17H19N3OS)]
method: RPBEPBE
basis: SDD
operation: Freq
keyword: #p
keyword: freq=noraman
keyword: PBEPBE/SDD
title: #p freq=noraman PBEPBE/SDD
converged: YES YES NO NO
title: Mulliken charges:
elementType: S O N N N C C C C C C C C C C C C C C C C C H H H H H H H H H H H H H H H H H H H
charge: 0.206941 -0.356031 -0.501775 -0.380085 -0.085149 0.390648 0.151507 -0.321503 -0.387558 -0.326573 0.527120 -0.322260 0.204881 -0.341162 -0.292373 -0.283700 -0.402064 -0.275115 -0.613722 -0.616453 -0.209864 -0.255260 0.255195 0.232899 0.197231 0.212454 0.379239 0.305300 0.199657 0.245323 0.232743 0.244679 0.240297 0.221918 0.194030 0.230115 0.191298 0.223833 0.224314 0.228484 0.230542
chargesum: 0.00000
title: Mulliken charges with hydrogens summed into heavy atoms:
elementType: S O N N N C C C C C C C C C C C C C C C C C
charge: 0.206941 -0.356031 -0.122537 -0.074785 -0.085149 0.390648 0.151507 -0.321503 0.100537 0.083112 0.527120 -0.322260 0.204881 -0.141506 -0.047050 -0.050957 -0.157385 -0.034819 0.032341 0.022991 0.018621 -0.024718
polarizability: 3.48994839e+02 -4.21303720e+01 2.85474722e+02 -1.15669399e+01 -2.94233336e+00 1.13401909e+02
1716.lowfreq: -6.1101 -5.4543 -0.0010 0.0010 0.0012 5.9494 11.8539 22.2472 27.4179
frequency: 10.9731 21.9946 27.3945 37.6456 50.3269 91.5117 93.9561 119.2817 150.1184 179.2971 186.0451 211.7400 227.7819 241.3603 244.6288 263.7836 294.3153 316.7272 331.1333 352.4608 371.1096 399.6023 416.5608 424.7456 434.0642 444.7063 474.9054 493.2228 529.1903 530.8409 539.9065 559.7295 607.4366 652.7276 666.3927 693.3310 701.4225 717.9683 735.9672 751.1744 775.7173 783.4982 819.9360 824.8174 849.5172 862.4992 882.3178 890.8389 916.6716 930.6840 949.1997 969.6432 1009.4723 1025.4573 1031.0419 1035.2597 1050.1192 1058.5699 1078.6826 1085.7336 1090.8538 1120.2772 1129.9215 1139.8462 1168.8459 1170.8284 1182.7246 1201.4592 1247.8790 1253.2521 1268.1706 1269.3492 1282.4088 1303.4276 1305.5666 1333.7338 1362.8322 1376.8437 1389.5685 1407.7075 1421.8926 1425.2429 1441.5005 1443.9702 1451.8838 1462.6117 1468.3413 1476.4475 1479.2243 1480.6397 1486.4752 1499.0317 1502.8392 1556.8506 1572.4559 1587.3133 1615.0435 1627.4826 2855.8035 2865.4401 2879.7193 3017.6541 3019.0907 3023.7415 3032.2641 3077.2342 3088.4460 3098.7412 3124.5984 3128.6299 3136.1635 3140.7453 3149.0440 3155.2065 3168.0490 3169.7527 3578.2638
redmass: 3.8074 3.2115 5.0123 6.0592 4.5179 2.4377 4.6350 3.6397 5.1647 4.4744 3.2680 1.1675 2.2797 3.6145 2.0628 2.7810 5.1628 5.3319 5.9098 2.4877 3.1616 6.8225 4.4516 3.0691 7.0247 3.4325 3.6101 4.9797 2.0851 3.7118 3.5684 2.1985 7.1199 5.9831 6.3502 6.2569 4.4610 2.9689 1.6981 1.3578 1.7788 2.8404 3.9163 3.7903 1.4657 3.4645 4.7840 1.4155 1.1872 1.3491 1.3447 1.3142 4.5153 3.1123 3.2530 1.5933 2.7338 2.5715 1.8566 2.0455 1.3265 2.3554 1.9019 1.5174 1.7198 1.0640 1.7759 1.4694 2.4793 1.7079 1.6794 2.0972 2.1819 1.3775 1.6002 1.3964 3.7698 1.3351 8.1693 3.0578 1.1431 2.4849 1.6280 1.4641 1.1890 1.0604 1.0643 1.0577 2.6998 1.0937 1.0569 3.7672 1.9906 6.3084 4.4313 6.5177 4.8471 2.7735 1.0570 1.0609 1.0644 1.0887 1.0733 1.0615 1.0735 1.1011 1.1010 1.1026 1.0870 1.0862 1.0891 1.0903 1.0941 1.0828 1.0987 1.1006 1.0771
irintensity: 0.2147 0.4955 0.3914 3.7897 0.5636 1.7364 2.0470 1.9079 0.6869 1.4950 2.4540 0.5056 0.7258 0.5519 1.3927 1.3180 2.3175 6.0730 11.2855 8.3291 4.5128 1.6706 3.4047 8.7567 0.4733 1.0408 31.2420 8.6982 34.8318 6.1589 2.9062 54.8181 7.4483 19.0436 11.3970 6.7006 2.9231 20.2951 42.9754 92.1237 9.0870 13.7948 10.8085 5.3450 1.0696 2.0598 2.8966 1.9970 74.7687 33.6996 0.2218 2.2790 6.2058 23.6604 15.5687 27.2776 6.2126 32.1558 8.1442 28.3643 6.0491 40.3988 5.3442 4.1138 4.6713 0.0738 10.2175 40.3056 15.0290 3.7568 29.5659 1.3002 356.9013 1.0668 11.1606 45.8920 42.2187 14.2718 7.1850 16.8853 3.4006 24.1340 10.1953 13.9950 86.6926 55.5949 5.3385 13.4050 141.9681 18.4134 15.6752 614.4733 336.0371 65.6793 59.6586 5.4187 4.5332 82.6053 89.0955 78.0087 153.6967 24.5942 53.1981 32.0591 56.4186 29.9148 51.3980 11.5672 9.3434 3.8066 2.8772 13.1641 7.8454 341.0425 24.0450 22.6245 23.0018
temp: 298.150 k
press: 1.00000 atm
elementType: 16 8 7 7 7 6 6 6 6 6 6 6 6 6 6 6 6 6 6 6 6 6 1 1 1 1 1 1 1 1 1 1 1 1 1 1 1 1 1 1 1
symmnumber: 1
zpe: 862151.6 jmol-1
zpe.correction: 0.328376 hartree
zpe.thermalcorrener: 0.349051 hartree
zpe.thermalcorrenthalpy: 0.349995 hartree
zpe.thermalcorrgfe: 0.275845 hartree
zpe.sumelectzpe: -1295.168822 hartree
zpe.sumelectthermal: -1295.148148 hartree
zpe.sumelectthermalent: -1295.147203 hartree
zpe.sumelectthermalfe: -1295.221353 hartree
dipole: -2.8622 1.5138 0.7265
dipole: 3.3183
quadrupole: -121.8181 -121.9906 -144.3910
quadrupole: -7.3110 3.5121 1.6064
quadrupole: 7.5818 7.4093 -14.9911 -7.3110 3.5121 1.6064
hfenergy: -1295.4971983 hartree
pointgroup: C01 [X(C17H19N3O1S1)]
dipole: -1.0870049 0.7218995 0.0414057 debye
polarizability: 342.8576106|-45.532546|274.8635126|9.4756581|-53.0171704|130.1503468 unknown
InChI: InChI=1S/C17H19N3OS/c1-20(2)11-10-18-17(21)12-6-5-9-15-16(12)19-13-7-3-4-8-14(13)22-15/h3-9,18-19H,10-11H2,1-2H3
charge 0 multiplicity 1
41 atoms
S  4.095661 0.610912 -0.902973
O  -1.176944 -1.004398 0.00627
N  1.427292 -0.858329 -0.1595
N  -2.391407 0.945439 0.264372
N  -5.83922 -0.583956 -0.266514
C  1.286281 0.503416 -0.424259
C  -0.023217 1.110128 -0.405806
C  2.416986 1.3328 -0.706517
C  -3.630932 0.223606 0.592656
C  -4.584788 0.114381 -0.624422
C  2.607628 -1.522795 0.226757
C  3.896828 -0.960167 0.030778
C  -1.217806 0.285418 -0.047695
C  -0.147572 2.491818 -0.733536
C  2.267776 2.704216 -0.958883
C  0.975571 3.2884 -0.99735
C  2.510413 -2.798005 0.844272
C  5.05253 -1.637972 0.463491
C  -5.669276 -2.046474 -0.124972
C  -6.957723 -0.250258 -1.172612
C  3.669961 -3.492987 1.247413
C  4.946181 -2.913705 1.067241
H  -3.334534 -0.779218 0.940364
H  -4.156385 0.739939 1.415663
H  -4.846007 1.134973 -0.964995
H  -4.03919 -0.383786 -1.464509
H  0.508583 -1.342997 -0.058768
H  -2.397236 1.963631 0.306338
H  -1.139894 2.950011 -0.816343
H  3.154046 3.315524 -1.160466
H  0.861597 4.34767 -1.245873
H  1.51746 -3.233581 1.004681
H  6.036288 -1.178838 0.315878
H  -6.615527 -2.493991 0.227826
H  -5.383007 -2.54592 -1.084851
H  -4.890503 -2.277045 0.621018
H  -6.796824 -0.59146 -2.226745
H  -7.885683 -0.722656 -0.80285
H  -7.115341 0.843021 -1.186449
H  3.573398 -4.480475 1.711167
H  5.849437 -3.442588 1.387402
