program: Gaussian 09
title: 000183345
version: EM64L-G09RevD.01
frameworkgroup: C1[X(C11H16N2O3)]
method: RPBEPBE
basis: SDD
operation: Freq
keyword: #p
keyword: freq=noraman
keyword: PBEPBE/SDD
title: #p freq=noraman PBEPBE/SDD
converged: YES YES NO NO
title: Mulliken charges:
elementType: O O O N N C C C C C C C C C C C H H H H H H H H H H H H H H H H
charge: -0.260437 -0.251824 -0.309174 -0.100558 -0.649058 -0.397192 -0.501190 -0.500848 0.247250 -0.320281 -0.166295 -0.244297 0.267826 0.121784 -0.263486 -0.661577 0.248741 0.235446 0.268279 0.257979 0.217050 0.215720 0.289257 0.237072 0.210547 0.225865 0.234865 0.327637 0.323187 0.218930 0.248296 0.230481
chargesum: 0.00000
title: Mulliken charges with hydrogens summed into heavy atoms:
elementType: O O O N N C C C C C C C C C C C
charge: -0.260437 -0.251824 -0.309174 -0.100558 0.001766 0.086995 0.025069 -0.068078 0.247250 -0.031023 0.070777 -0.033750 0.267826 0.121784 0.197244 0.036131
polarizability: 2.05954672e+02 -5.09460146e+00 1.43820089e+02 -1.56047615e+01 -2.18784116e+00 9.45303285e+01
1716.lowfreq: -6.8210 -0.0006 0.0005 0.0009 2.5827 3.7441 14.8790 21.6619 36.1112
frequency: 14.3725 21.6431 36.0658 46.9061 72.1951 77.9224 98.9923 107.9570 158.1184 181.4167 205.2849 224.8819 274.0106 307.4277 336.4349 371.8143 384.9097 416.7056 438.3351 448.3600 475.8760 529.2710 545.3191 569.0916 581.6199 587.9833 659.6888 702.5219 710.9560 733.6837 778.2988 789.1234 816.2874 867.0043 908.4469 928.7934 930.9994 940.5512 990.7915 996.7138 1005.8131 1030.2623 1041.6040 1045.0872 1079.0630 1095.9369 1128.9055 1156.4516 1167.4166 1195.9510 1199.9602 1219.3899 1268.0461 1278.3434 1299.0221 1301.3222 1337.4012 1354.7746 1366.0541 1372.8907 1391.5582 1396.5920 1422.5113 1445.3238 1457.4601 1464.4160 1478.7704 1484.8147 1487.6140 1555.9227 1610.0013 1630.8441 1637.5839 1697.9228 2889.2317 2905.7539 2994.3316 2999.1533 3020.3913 3030.9669 3068.7775 3089.4776 3091.4421 3095.1260 3121.3559 3141.8686 3149.5069 3170.9166 3529.0562 3685.1108
redmass: 5.0057 4.7784 3.9319 3.6450 4.3093 3.4483 2.6870 3.0590 3.0576 4.0468 3.9440 1.3582 3.8741 2.6346 3.1167 4.4785 3.7429 2.9941 3.2424 1.2188 3.5319 3.2720 3.9646 1.1808 3.1573 4.0219 4.5702 3.5398 3.0163 1.9690 1.5388 1.8843 1.5710 3.6083 3.4747 1.7319 2.0747 1.4166 2.6574 1.6963 2.7826 2.2000 3.5562 2.0207 2.4368 2.1771 2.2330 1.6407 1.6741 1.1490 1.0735 3.0031 1.2560 1.1186 1.5103 1.4547 1.9042 1.2707 1.4710 2.9708 1.2318 1.7270 3.1878 1.0960 1.0942 1.0436 1.1011 1.0512 1.0942 3.8239 1.5931 8.7453 4.5019 6.2924 1.0570 1.1010 1.0361 1.0644 1.0602 1.0595 1.0985 1.0974 1.1031 1.1032 1.1063 1.0853 1.0927 1.1002 1.0443 1.1041
irintensity: 3.1675 1.3450 2.2049 2.7012 4.0952 4.0244 1.3073 2.4582 1.0860 7.9893 3.2223 6.1490 3.9614 13.7447 0.4321 0.9853 5.9338 1.1922 2.7354 182.4313 8.5815 30.3183 25.8389 78.0034 11.6385 8.7446 1.9004 12.2822 72.3124 3.2903 11.3939 6.3563 4.7945 4.7534 9.4901 2.5899 0.2509 13.4087 30.5449 5.7001 35.1153 31.9244 65.1085 8.9587 16.0474 40.1333 313.1958 5.3558 133.3412 58.1430 0.9673 139.5380 27.9466 2.9120 134.3428 59.2162 160.3916 2.7765 113.8706 34.1982 22.7181 21.3220 39.4360 19.5073 14.7697 15.4160 12.6441 14.0519 5.0765 362.1602 121.9447 183.7375 145.7227 144.4141 96.0950 43.0400 18.1413 2.1943 25.1881 31.5982 0.4793 34.4581 13.2873 0.5954 31.1194 2.1773 0.8838 25.5404 37.6270 26.6290
temp: 298.150 k
press: 1.00000 atm
elementType: 8 8 8 7 7 6 6 6 6 6 6 6 6 6 6 6 1 1 1 1 1 1 1 1 1 1 1 1 1 1 1 1
symmnumber: 1
zpe: 683990.4 jmol-1
zpe.correction: 0.260518 hartree
zpe.thermalcorrener: 0.277540 hartree
zpe.thermalcorrenthalpy: 0.278485 hartree
zpe.thermalcorrgfe: 0.212211 hartree
zpe.sumelectzpe: -762.720831 hartree
zpe.sumelectthermal: -762.703809 hartree
zpe.sumelectthermalent: -762.702864 hartree
zpe.sumelectthermalfe: -762.769138 hartree
dipole: 0.8296 -2.7218 2.1148
dipole: 3.5452
quadrupole: -67.8714 -102.3763 -98.7548
quadrupole: 14.9326 -2.6258 -1.0968
quadrupole: 21.7961 -12.7088 -9.0873 14.9326 -2.6258 -1.0968
hfenergy: -762.981349 hartree
pointgroup: C01 [X(C11H16N2O3)]
dipole: 0.3111626 1.2328929 -0.5732482 debye
polarizability: 205.8667545|2.3153413|142.3885723|16.3619993|8.9076846|96.0497631 unknown
InChI: InChI=1S/C11H16N2O3/c1-2-16-10(14)5-7-13-6-3-4-9(8-13)11(12)15/h3,6,8H,2,4-5,7,12H2,1H3
charge 0 multiplicity 1
32 atoms
O  3.836806 -0.173668 -1.174453
O  3.646005 0.886883 0.89759
O  -3.038545 -2.655033 -0.340777
N  -0.659316 0.703617 0.518008
N  -4.869121 -1.332672 -0.865807
C  0.769098 0.495776 0.807061
C  1.636496 0.484241 -0.478487
C  -3.450652 1.146848 -0.350467
C  -2.797452 -0.230257 -0.191825
C  -1.490406 -0.367899 0.210338
C  -1.180176 2.012429 0.38393
C  -2.461156 2.254626 -0.008598
C  3.118678 0.434021 -0.147304
C  -3.543646 -1.487276 -0.459954
C  5.321932 -0.276794 -0.989273
C  5.68051 -1.545852 -0.21219
H  1.128321 1.292592 1.481382
H  0.887252 -0.460965 1.346159
H  1.373693 -0.360214 -1.13762
H  1.446358 1.410802 -1.055657
H  -4.348091 1.234279 0.305172
H  -3.828623 1.288555 -1.389749
H  -1.071499 -1.375219 0.308089
H  -0.486155 2.820041 0.636087
H  -2.800151 3.293967 -0.07055
H  5.707036 -0.29773 -2.021031
H  5.673314 0.629632 -0.465802
H  -5.403917 -2.178291 -1.056892
H  -5.316177 -0.425025 -0.971271
H  6.780005 -1.653397 -0.163026
H  5.294142 -1.496683 0.819531
H  5.268632 -2.441434 -0.708212
