program: Gaussian 09
title: 000183340
version: EM64L-G09RevD.01
frameworkgroup: C1[X(C19H26O4)]
method: RPBEPBE
basis: SDD
operation: Freq
keyword: #pfreq=noraman
keyword: PBEPBE/SDD
title: #p freq=noraman PBEPBE/SDD
converged: NO YES NO NO
title: Mulliken charges:
elementType: O O O O C C C C C C C C C C C C C C C C C C C H H H H H H H H H H H H H H H H H H H H H H H H H H
charge: -0.228150 -0.289159 -0.192107 -0.243405 0.419862 -0.202532 -0.570754 -0.156472 -0.551281 -0.087918 -0.147047 0.387653 -0.822679 -0.517625 0.293607 -0.399760 0.069843 -0.854159 -0.701138 0.272291 -0.202140 -0.684013 -0.689562 0.216430 0.238872 0.251640 0.238132 0.233195 0.222214 0.247269 0.285219 0.213065 0.243989 0.246333 0.226986 0.240283 0.218848 0.225936 0.231732 0.230773 0.228304 0.259791 0.239897 0.221313 0.237230 0.220785 0.220263 0.220622 0.237524
chargesum: 0.00000
title: Mulliken charges with hydrogens summed into heavy atoms:
elementType: O O O O C C C C C C C C C C C C C C C C C C C
charge: -0.228150 -0.289159 -0.192107 -0.243405 0.419862 0.013897 -0.080242 0.081660 -0.095871 0.159351 0.138172 0.387653 -0.119293 -0.050355 0.293607 -0.180912 0.069843 -0.165717 -0.213044 0.272291 0.037756 -0.004685 -0.011153
polarizability: 2.65912455e+02 -1.56954717e+00 2.21455665e+02 5.53112647e+00 5.61458188e-01 1.48335361e+02
1716.lowfreq: -6.8196 -0.0005 0.0003 0.0005 5.0933 11.0969 27.3357 32.0763 39.7408
frequency: 27.0396 32.0554 39.6989 48.2468 61.8187 77.2675 121.9137 140.8670 155.6849 180.5311 192.0791 202.8446 210.8165 212.7601 220.1789 226.5406 244.9786 252.9571 265.0850 276.2476 296.1825 298.2954 308.1233 313.0672 336.1756 370.6322 381.6840 397.2362 417.1053 446.8355 468.3047 500.0238 512.1861 537.4107 552.3029 597.2233 602.0655 642.1541 647.0592 668.8948 678.9623 704.9961 713.4695 768.0388 787.0946 800.5387 814.0690 823.0962 850.0901 854.5510 897.6013 915.9548 928.6943 932.2074 947.5402 951.8137 958.6543 963.1200 964.0522 979.0444 1005.2779 1015.7984 1028.0508 1039.7365 1046.8918 1075.5483 1084.7842 1092.0535 1098.4624 1102.3999 1105.4053 1109.8500 1127.0353 1143.7114 1173.1130 1174.7669 1190.4639 1198.5951 1202.8629 1223.3728 1238.4224 1260.8646 1275.2348 1287.9059 1292.0447 1301.1055 1305.3991 1326.7669 1332.2801 1332.6554 1345.4622 1352.3608 1355.3144 1359.5266 1376.7813 1380.5253 1392.5162 1396.3182 1399.7242 1420.7928 1459.8382 1463.2916 1465.3134 1468.1851 1470.1080 1472.9253 1477.1302 1479.1931 1485.4145 1490.8701 1500.6631 1639.8981 1681.6382 1683.3325 1693.7890 2892.8327 2924.7171 2962.7475 2971.6556 2985.4016 2987.3796 2989.8780 2993.4569 2996.1975 3001.3203 3007.3693 3026.3761 3035.9077 3036.8688 3054.7386 3066.4826 3080.5214 3081.6295 3085.4111 3085.7955 3091.8601 3092.9026 3097.1844 3099.4641 3105.5838 3206.0641
redmass: 3.1332 6.1807 3.8821 4.2110 3.4859 5.7999 3.0231 4.3288 3.8009 3.6114 2.3791 1.8233 1.7063 1.4827 1.8049 1.6866 1.4976 2.2657 3.5019 2.0857 2.8206 3.6840 2.5319 2.6817 2.8524 2.9890 3.6441 2.9482 2.7293 3.7270 3.4741 3.2099 4.2043 3.4866 3.5692 3.0462 3.9842 4.2931 2.6789 3.7151 3.1013 2.6898 6.1474 3.2769 2.2733 1.7101 2.8252 2.7231 2.3395 2.5428 2.6205 1.9524 1.1676 2.7863 2.7038 2.5053 2.1461 1.4792 1.9325 1.3668 2.0152 2.0852 2.8352 2.0322 1.7671 2.0508 2.5564 3.2086 1.5787 2.1814 2.5078 1.8457 2.0169 2.3278 1.7121 1.8556 1.9088 1.7035 2.1064 1.5724 2.2105 1.3561 1.5310 1.3928 1.5006 1.2862 1.3255 1.4415 1.5472 1.4174 1.8681 1.5441 1.6589 1.4321 1.1872 1.4491 1.2119 1.2084 1.2352 1.1832 1.0733 1.0875 1.0458 1.0680 1.0629 1.0673 1.0624 1.0499 1.0620 1.0588 1.0551 9.1996 7.0469 7.5489 10.5025 1.0806 1.0793 1.0382 1.0624 1.0347 1.0350 1.0661 1.0553 1.0544 1.0652 1.0884 1.0939 1.0959 1.0856 1.1023 1.1022 1.0981 1.1006 1.0985 1.0998 1.1011 1.0989 1.0616 1.0997 1.0909 1.1154
irintensity: 0.3790 2.2970 0.5513 1.2178 0.5288 2.6448 0.1156 0.9310 1.2560 1.4131 0.8006 0.2632 0.4550 0.3838 1.7731 0.5807 3.1662 1.7075 0.6760 1.5916 15.1170 1.2278 0.3208 2.9169 3.8512 1.5454 1.4299 2.3426 2.8139 0.5440 5.1755 4.7150 1.2783 0.2376 8.4671 3.8594 9.3344 1.0494 1.8055 4.8482 4.6579 2.4472 4.7016 12.1800 8.8055 3.9810 16.0180 18.0780 7.0166 4.0545 13.4918 72.0823 7.6070 63.5424 92.7319 32.6935 14.5498 1.6395 16.1699 53.4213 22.8739 61.9501 93.3258 24.5561 16.7146 0.8271 249.8113 79.8986 39.3440 109.6516 1.1147 20.8152 1.8953 27.8940 1.5353 4.7170 3.2318 4.5895 0.3187 12.2511 42.5015 5.5356 7.8849 6.0293 1.6921 1.6269 0.7068 3.1475 23.0425 10.1669 12.2145 3.5523 1.0319 5.4967 14.5231 16.5173 36.7497 25.2098 13.5347 23.7378 19.6068 9.1719 5.2231 10.8570 13.1012 2.6443 8.0588 17.5300 6.3236 25.3978 4.6016 127.9318 0.2092 78.4450 243.8462 19.6209 8.3956 32.5631 22.8940 26.8552 30.0709 5.9232 18.4811 2.3268 58.8533 12.8492 16.9795 20.6725 5.5912 29.9879 26.8184 24.3527 24.9997 37.3845 44.1489 2.5254 17.5274 4.6897 43.5070 38.8486 3.9310
temp: 298.150 k
press: 1.00000 atm
elementType: 8 8 8 8 6 6 6 6 6 6 6 6 6 6 6 6 6 6 6 6 6 6 6 1 1 1 1 1 1 1 1 1 1 1 1 1 1 1 1 1 1 1 1 1 1 1 1 1 1
symmnumber: 1
zpe: 1080094.4 jmol-1
zpe.correction: 0.411386 hartree
zpe.thermalcorrener: 0.434445 hartree
zpe.thermalcorrenthalpy: 0.435390 hartree
zpe.thermalcorrgfe: 0.359249 hartree
zpe.sumelectzpe: -1038.747921 hartree
zpe.sumelectthermal: -1038.724861 hartree
zpe.sumelectthermalent: -1038.723917 hartree
zpe.sumelectthermalfe: -1038.800058 hartree
dipole: 1.4287 6.1196 1.7034
dipole: 6.5109
quadrupole: -133.2156 -152.1593 -141.8003
quadrupole: -21.9666 5.4926 -4.0666
quadrupole: 9.1761 -9.7676 0.5914 -21.9666 5.4926 -4.0666
hfenergy: -1039.1593069 hartree
pointgroup: C01 [X(C19H26O4)]
dipole: -0.7458966 2.3255283 -0.7728271 debye
polarizability: 265.1560077|5.4473911|221.8941277|7.2034747|-2.8732281|148.6533451 unknown
InChI: InChI=1S/C19H26O4/c1-10(2)17(20)23-16-7-6-11(3)14-8-13-12(4)18(21)22-15(13)9-19(14,16)5/h6,10,13-16H,4,7-9H2,1-3,5H3
charge 0 multiplicity 1
49 atoms
O  2.028761 -2.36681 -0.060973
O  -2.757922 0.068131 -0.53437
O  4.194392 -3.186486 0.289837
O  -3.078156 -0.914052 1.566248
C  -0.337301 0.695329 -0.514036
C  0.631814 1.69848 0.232473
C  0.024337 -0.786747 -0.141154
C  2.402235 -0.040182 0.357841
C  2.135752 1.41034 -0.070678
C  1.501193 -1.008756 -0.434776
C  -1.756082 1.029118 0.032236
C  0.193131 3.158333 0.046452
C  -0.30657 0.884154 -2.055141
C  -2.222002 2.441133 -0.354347
C  3.74274 -0.732244 0.237045
C  -1.112349 3.463903 -0.195433
C  3.433429 -2.213074 0.164369
C  1.23073 4.25096 0.227545
C  5.004353 -0.241561 0.207245
C  -3.344177 -0.859004 0.343494
C  -4.321305 -1.769545 -0.392611
C  -3.78623 -3.226382 -0.354634
C  -5.720194 -1.673646 0.268513
H  0.517256 1.478021 1.321441
H  -0.60344 -1.479795 -0.729061
H  -0.179298 -0.973321 0.930944
H  2.093877 -0.135279 1.424804
H  2.371792 1.55775 -1.141993
H  2.773889 2.107269 0.502671
H  1.70413 -0.903503 -1.518196
H  -1.761307 0.898454 1.131554
H  0.663614 0.596704 -2.494289
H  -1.08764 0.259018 -2.522873
H  -0.48982 1.935059 -2.335108
H  -3.092909 2.72416 0.268478
H  -2.589139 2.43167 -1.400921
H  -1.407621 4.518262 -0.286453
H  1.710208 4.192572 1.225227
H  0.772707 5.250517 0.132783
H  2.042753 4.177305 -0.52115
H  5.209019 0.833261 0.265032
H  5.858839 -0.92248 0.122172
H  -4.379195 -1.425797 -1.440357
H  -4.485122 -3.895891 -0.887103
H  -3.694668 -3.574149 0.689434
H  -2.795307 -3.31194 -0.836293
H  -6.424347 -2.355031 -0.241554
H  -6.128816 -0.648765 0.20957
H  -5.660634 -1.961658 1.332698
