program: Gaussian 09
title: 000183324
version: EM64L-G09RevD.01
frameworkgroup: C1[X(C13H16ClN5)]
method: RPBEPBE
basis: SDD
operation: Freq
keyword: #p
keyword: freq=noraman
keyword: PBEPBE/SDD
title: #p freq=noraman PBEPBE/SDD
converged: YES YES NO NO
title: Mulliken charges:
elementType: Cl N N N N N C C C C C C C C C C C C C H H H H H H H H H H H H H H H H
charge: -0.025996 -0.356052 -0.124361 -0.158539 -0.018569 -0.040900 -0.145713 0.402284 -0.724802 -0.411746 -0.376029 0.100981 -0.234559 -0.232526 0.204682 -0.237870 -0.624751 -0.623628 -0.302119 0.252090 0.335555 0.217246 0.248178 0.214115 0.245400 0.251018 0.226499 0.229217 0.231253 0.224983 0.283167 0.226269 0.223292 0.222704 0.299229
chargesum: 0.00000
title: Mulliken charges with hydrogens summed into heavy atoms:
elementType: Cl N N N N N C C C C C C C C C C C C C
charge: -0.025996 -0.020497 -0.124361 -0.158539 -0.018569 -0.040900 0.106376 0.402284 -0.045262 -0.166346 -0.125011 0.100981 -0.008060 -0.003309 0.204682 -0.006617 0.109668 0.121596 -0.302119
polarizability: 2.67440854e+02 8.33887633e+00 1.86199545e+02 -1.09518317e+01 7.62239506e+00 1.33477637e+02
1716.lowfreq: -7.3824 -6.4608 -0.0004 -0.0003 0.0006 4.6550 13.7549 31.2261 34.6093
frequency: 13.6564 31.1141 34.5380 73.6581 82.7625 102.9387 120.9374 124.5066 147.7898 166.4560 171.8869 187.3848 208.7291 238.6271 271.7237 278.8275 299.2647 335.7845 369.4338 373.8620 401.9674 442.9831 471.6347 507.2494 519.6122 561.4836 583.3424 598.2910 616.6986 641.1493 665.6868 696.3822 705.0613 750.0169 783.1348 791.5961 802.8017 855.6179 887.5422 888.8480 923.6634 958.7960 980.0815 990.6868 998.1024 1018.3051 1032.1977 1044.4096 1055.6300 1069.8830 1098.5853 1101.0336 1131.3086 1150.7103 1174.0197 1178.4422 1189.1090 1192.5679 1212.5060 1261.5480 1269.4764 1292.0958 1317.1284 1342.4469 1372.4963 1382.8834 1385.2948 1413.2124 1414.7860 1431.5114 1437.3607 1463.9350 1468.7620 1472.7401 1480.2082 1482.3801 1485.3048 1491.5045 1513.0719 1544.2951 1592.3960 1595.5848 1615.0628 2966.4542 2972.1834 2988.1077 3003.8648 3040.6221 3043.0725 3086.2125 3097.4088 3123.0564 3129.7906 3131.7500 3131.9763 3142.4213 3153.1284 3166.1885 3551.4151
redmass: 4.2365 3.8152 5.6481 3.1901 3.4272 1.7442 1.4132 2.3224 1.9398 5.8315 6.3362 8.7820 3.8365 3.8057 3.1301 1.1741 3.6889 4.6310 3.5407 4.0588 2.8051 5.0111 3.2574 3.6690 5.0253 4.7556 1.9111 1.9308 6.3626 7.2329 6.4370 11.4900 1.8295 2.0948 12.0745 2.5666 7.3609 1.2468 2.7864 8.2744 1.3764 3.0463 1.3875 6.1582 1.3133 2.2240 2.6778 1.8521 1.4223 2.1774 1.2178 2.0006 3.1363 1.3712 1.0521 3.5144 2.7481 1.2363 2.0713 4.1789 6.0987 1.9313 1.3374 1.3601 2.4527 5.4030 1.2605 1.2341 1.3368 3.0036 2.2058 1.2673 1.0508 1.0664 1.0553 1.0963 2.0552 1.0452 2.7287 5.4090 5.6806 4.8701 6.0365 1.0366 1.0370 1.0365 1.0820 1.1013 1.1016 1.1001 1.0998 1.0850 1.0876 1.0962 1.0972 1.0926 1.0953 1.1012 1.0772
irintensity: 0.0037 0.1333 0.0260 0.8498 0.2651 2.9675 0.4419 0.0512 1.8429 1.1192 0.5279 0.7199 2.3121 2.1811 4.2960 0.5871 0.8548 12.8630 4.2928 8.8869 0.7181 2.9952 1.9817 13.5159 2.6351 15.0277 61.0555 48.5544 0.4425 14.5942 5.4809 1.0516 47.3217 24.4368 20.5496 26.5255 51.0547 0.1656 19.7208 7.0189 0.6609 99.1521 0.3356 0.7161 0.3811 27.4905 36.1620 15.5114 9.6881 9.8168 0.2218 41.9024 105.1592 0.0498 0.2092 65.8819 119.9066 5.1640 11.4022 17.9398 38.2241 65.4299 18.9234 32.5631 249.4228 8.8851 30.0277 76.5745 49.7200 179.5830 23.4070 191.2376 10.1117 8.9582 1.8546 5.9863 24.5210 32.3827 163.6546 1633.5910 55.4866 199.5372 5.0439 24.4971 171.6738 20.7785 10.5929 52.6036 16.3327 30.3651 28.9062 3.8952 1.0605 1.8939 0.2520 22.3647 35.2035 19.9105 75.2093
temp: 298.150 k
press: 1.00000 atm
elementType: 17 7 7 7 7 7 6 6 6 6 6 6 6 6 6 6 6 6 6 1 1 1 1 1 1 1 1 1 1 1 1 1 1 1 1
symmnumber: 1
zpe: 727079.2 jmol-1
zpe.correction: 0.276930 hartree
zpe.thermalcorrener: 0.295590 hartree
zpe.thermalcorrenthalpy: 0.296535 hartree
zpe.thermalcorrgfe: 0.227575 hartree
zpe.sumelectzpe: -1237.424783 hartree
zpe.sumelectthermal: -1237.406123 hartree
zpe.sumelectthermalent: -1237.405179 hartree
zpe.sumelectthermalfe: -1237.474138 hartree
dipole: -2.6316 4.8680 -0.2136
dipole: 5.5379
quadrupole: -110.6413 -119.1497 -114.5175
quadrupole: 17.4515 -3.8345 2.1179
quadrupole: 4.1282 -4.3802 0.2520 17.4515 -3.8345 2.1179
hfenergy: -1237.7017133 hartree
pointgroup: C01 [X(C13H16Cl1N5)]
dipole: 1.2945922 -0.9744775 1.4565538 debye
polarizability: 261.0653907|28.7806338|148.8211757|-4.1529841|-23.46596|177.2314697 unknown
InChI: InChI=1S/C13H16ClN5/c1-9(10-7-5-4-6-8-10)15-12-16-11(14)17-13(18-12)19(2)3/h4-9,15H,1-3H3
charge 0 multiplicity 1
35 atoms
Cl -4.150071 1.209571 -2.393883
N  0.451197 0.842995 -0.405829
N  -2.923491 -1.955922 1.345093
N  -1.189082 -0.571424 0.52943
N  -1.703843 0.980481 -1.292778
N  -3.440626 -0.45734 -0.404838
C  1.521961 0.377332 0.505959
C  2.851579 0.332768 -0.262497
C  1.537549 1.214157 1.804656
C  4.038784 0.926687 0.230888
C  2.90271 -0.356176 -1.504456
C  -0.83858 0.395001 -0.3702
C  5.248357 0.835579 -0.497541
C  4.106946 -0.447697 -2.233487
C  -2.501472 -0.979603 0.47757
C  5.287826 0.149209 -1.731028
C  -2.007271 -2.567931 2.317859
C  -4.313225 -2.439047 1.342686
C  -2.951281 0.489959 -1.221056
H  1.236726 -0.6568 0.780927
H  0.648628 1.58458 -1.081341
H  2.263296 0.806057 2.531047
H  0.536848 1.180209 2.267411
H  1.793822 2.270343 1.605428
H  4.029574 1.465157 1.183885
H  1.989285 -0.818259 -1.89786
H  6.157231 1.302167 -0.101061
H  4.126684 -0.983055 -3.189346
H  6.224562 0.079989 -2.295118
H  -2.386356 -2.417064 3.346984
H  -1.017537 -2.101429 2.219154
H  -1.922008 -3.656308 2.133227
H  -4.783341 -2.256669 2.328258
H  -4.338685 -3.526466 1.137116
H  -4.874296 -1.904254 0.564143
