program: Gaussian 09
title: 000183323
version: EM64L-G09RevD.01
frameworkgroup: C1[X(C15H20ClN5)]
method: RPBEPBE
basis: SDD
operation: Freq
keyword: #p
keyword: freq=noraman
keyword: PBEPBE/SDD
title: #p freq=noraman PBEPBE/SDD
converged: YES YES NO NO
title: Mulliken charges:
elementType: Cl N N N N N C C C C C C C C C C C C C C C H H H H H H H H H H H H H H H H H H H H
charge: -0.026778 -0.381778 -0.325593 -0.136032 -0.022258 -0.032422 0.308203 -0.747409 -0.698410 -0.697565 -0.224938 0.484341 0.101652 -0.731002 0.117764 -0.400058 -0.389955 -0.235315 -0.236860 -0.239733 -0.294737 0.222363 0.227878 0.222530 0.261803 0.213003 0.206430 0.213148 0.206197 0.262600 0.335704 0.271456 0.313926 0.234965 0.239580 0.199056 0.228009 0.268603 0.223631 0.228688 0.229318
chargesum: 0.00000
title: Mulliken charges with hydrogens summed into heavy atoms:
elementType: Cl N N N N N C C C C C C C C C C C C C C C
charge: -0.026778 -0.046074 -0.011667 -0.136032 -0.022258 -0.032422 0.308203 -0.074639 -0.017174 -0.015621 0.046518 0.484341 0.101652 -0.057402 0.117764 -0.172050 -0.121353 -0.011684 -0.008172 -0.010415 -0.294737
polarizability: 2.59037655e+02 1.02028669e+01 2.17666687e+02 -3.04612221e-01 -1.36812784e+01 1.67522802e+02
1716.lowfreq: -12.7615 -3.0869 -0.0007 0.0005 0.0019 5.9002 7.8343 22.8807 27.5355
frequency: -11.8338 22.4738 27.1644 45.4332 70.5841 81.4057 119.8323 126.7006 159.0065 176.9973 196.3236 205.7552 209.2317 223.9051 241.0359 261.7753 264.3978 279.5713 301.9824 316.3272 337.5189 343.1623 376.7014 400.4198 401.5263 430.7328 457.0806 467.4855 510.8194 552.4600 569.0647 584.5382 598.2861 616.1843 624.5880 644.0356 701.4747 702.9808 708.3927 751.9913 765.9916 785.1753 789.8346 856.1526 859.1376 884.4468 891.2577 914.7429 925.5156 928.5692 951.2270 974.1806 982.6117 990.2695 1000.5603 1012.4634 1023.6273 1033.0127 1035.4284 1044.6001 1065.9110 1110.2348 1120.8219 1173.6330 1177.4519 1193.3063 1213.6144 1228.0394 1234.7675 1243.5721 1261.7786 1300.0832 1311.2142 1342.2669 1351.3391 1368.8896 1373.7101 1386.4700 1391.3765 1395.6233 1412.6997 1443.3824 1450.4347 1458.1855 1467.7548 1471.7964 1473.1646 1474.9785 1481.6625 1485.0403 1485.7078 1501.9470 1513.4543 1540.6237 1585.2065 1594.2107 1613.2627 2977.0172 2984.8768 2984.9199 2989.1644 3048.2949 3069.6770 3080.4637 3080.5953 3084.5420 3096.5808 3099.4231 3104.8415 3108.5910 3121.2416 3126.6071 3137.6672 3147.4461 3163.2697 3535.6948 3544.5872
redmass: 4.0695 4.8447 4.7790 3.4615 4.1350 3.8415 5.7413 5.1086 7.9400 7.0596 3.1444 1.2046 3.2347 3.3987 2.9312 1.1270 1.1249 1.0805 2.8653 4.0495 2.4410 5.2366 2.7475 5.5365 2.9425 3.8273 3.0812 3.2855 3.3537 3.7209 2.5116 1.2033 1.6305 6.2779 4.9185 6.8889 5.4890 4.9198 2.2469 3.0544 2.9041 5.0943 3.3731 3.5641 1.4084 2.4936 5.7862 1.6937 1.6656 1.4128 1.2058 3.0314 1.4000 5.5227 1.3271 2.4707 2.5478 1.3930 1.5730 1.7416 2.2899 1.8909 3.0572 1.1103 2.6639 1.1187 2.6112 2.5997 3.0439 5.9255 4.0719 1.5047 1.6745 2.3366 1.4474 1.2061 1.2015 4.1415 1.2895 1.2528 1.5714 2.1301 1.0482 3.3028 1.0773 1.0762 1.0500 1.1681 1.2834 1.0547 1.5980 1.1647 1.7394 7.0251 7.0774 5.9785 5.9363 1.0363 1.0354 1.0375 1.0361 1.0857 1.1005 1.1001 1.0963 1.0996 1.0982 1.1004 1.1000 1.0995 1.0845 1.0879 1.0920 1.0963 1.1016 1.0763 1.0765
irintensity: 0.0589 0.8651 0.1811 0.0239 0.1573 0.6316 0.4497 1.9771 0.8377 0.8048 0.5227 0.2075 1.5156 2.2606 0.3599 0.1116 0.1039 0.1969 0.4936 3.1386 0.7769 5.3304 2.9371 6.8122 0.8924 0.7937 0.6736 4.4416 12.5982 24.7131 9.5460 62.5384 100.2111 1.3433 8.4787 24.8392 3.6432 33.3216 43.1023 8.8347 8.9011 31.6661 35.1339 25.1075 4.2947 5.4332 25.1265 0.3250 9.1595 5.6843 0.4655 49.3460 0.7133 1.5668 1.0169 11.9602 20.3739 0.0350 1.2922 7.0985 11.6338 13.5462 43.9281 4.8530 57.1416 3.5945 39.4858 264.4518 21.3157 16.4407 15.4252 7.6130 128.3857 222.4147 23.1734 30.9602 19.7910 2.3796 11.7451 83.7035 45.4523 10.0777 0.5786 194.5663 0.3809 12.4255 1.7233 48.4994 19.2983 9.5412 9.8493 50.3919 103.3433 1919.8017 167.2314 0.1577 4.0191 24.1437 24.6757 31.0215 31.7138 5.1352 20.7880 23.8689 31.1862 27.1716 47.8459 33.3900 2.0367 25.9769 1.6575 0.3968 12.2329 36.6425 27.0997 71.5494 37.2469
temp: 298.150 k
press: 1.00000 atm
elementType: 17 7 7 7 7 7 6 6 6 6 6 6 6 6 6 6 6 6 6 6 6 1 1 1 1 1 1 1 1 1 1 1 1 1 1 1 1 1 1 1 1
symmnumber: 1
zpe: 872922.6 jmol-1
zpe.correction: 0.332479 hartree
zpe.thermalcorrener: 0.352622 hartree
zpe.thermalcorrenthalpy: 0.353566 hartree
zpe.thermalcorrgfe: 0.283047 hartree
zpe.sumelectzpe: -1315.885112 hartree
zpe.sumelectthermal: -1315.864969 hartree
zpe.sumelectthermalent: -1315.864025 hartree
zpe.sumelectthermalfe: -1315.934544 hartree
dipole: 0.7061 -5.0794 0.4646
dipole: 5.1493
quadrupole: -113.3654 -139.2571 -126.4769
quadrupole: -2.3614 -2.0067 -2.3791
quadrupole: 13.0010 -12.8906 -0.1104 -2.3614 -2.0067 -2.3791
hfenergy: -1316.2175911 hartree
pointgroup: C01 [X(C15H20Cl1N5)]
dipole: 0.4706492 1.9228601 0.4304616 debye
polarizability: 256.7182924|-13.1777329|223.1476118|-4.0593044|3.9939413|164.3612392 unknown
InChI: InChI=1S/C15H20ClN5/c1-10(11-8-6-5-7-9-11)17-13-18-12(16)19-14(20-13)21-15(2,3)4/h5-10,17,21H,1-4H3
charge 0 multiplicity 1
41 atoms
Cl 0.406572 -4.074432 -1.271607
N  3.629133 -0.509478 0.158794
N  -0.715166 0.848448 -1.066937
N  1.454866 0.254252 -0.441034
N  2.085501 -2.108425 -0.519921
N  -0.162604 -1.447073 -1.136248
C  4.249658 0.804277 0.514033
C  5.703536 0.4830 0.939514
C  4.254293 1.744095 -0.720257
C  3.483396 1.456053 1.694966
C  -2.123726 0.628095 -1.486551
C  -3.061784 0.674814 -0.266381
C  2.358944 -0.756697 -0.273658
C  -2.478492 1.621414 -2.609851
C  0.210148 -0.137805 -0.875261
C  -3.806127 1.82817 0.085807
C  -3.161328 -0.479424 0.554861
C  -4.627156 1.831681 1.237462
C  -3.980821 -0.478403 1.703887
C  -4.716385 0.67973 2.050875
C  0.833792 -2.331707 -0.935661
H  6.266929 0.010602 0.112909
H  6.226281 1.413939 1.217139
H  5.723745 -0.192005 1.815748
H  3.22285 1.942707 -1.053402
H  4.81615 1.288227 -1.555373
H  4.735065 2.704086 -0.458489
H  3.49985 0.797227 2.581827
H  3.958434 2.416779 1.964526
H  2.434819 1.644674 1.4134
H  4.202246 -1.353036 0.242964
H  -2.143307 -0.398052 -1.891655
H  -0.419072 1.791258 -0.803583
H  -3.522672 1.4762 -2.936987
H  -1.813861 1.462016 -3.476089
H  -2.366982 2.67384 -2.287207
H  -3.759773 2.727722 -0.53865
H  -2.589642 -1.375274 0.283994
H  -5.199273 2.730048 1.496325
H  -4.050191 -1.378717 2.324683
H  -5.355047 0.681777 2.941389
