program: Gaussian 09
title: 000183318
version: EM64L-G09RevD.01
frameworkgroup: C1[X(C12H14ClN5)]
method: RPBEPBE
basis: SDD
operation: Freq
keyword: #p
keyword: freq=noraman
keyword: PBEPBE/SDD
title: #p freq=noraman PBEPBE/SDD
converged: YES YES NO NO
title: Mulliken charges:
elementType: Cl N N N N N C C C C C C C C C C C C H H H H H H H H H H H H H H
charge: -0.019741 -0.352415 -0.122564 -0.017489 -0.333930 -0.021378 -0.150478 0.405300 -0.724123 -0.411884 -0.373672 0.112522 -0.234212 -0.232894 -0.237672 0.105867 -0.291825 -0.603698 0.257943 0.218594 0.246987 0.213126 0.335254 0.245704 0.249403 0.226637 0.229243 0.231398 0.338521 0.246436 0.216560 0.248479
chargesum: 0.00000
title: Mulliken charges with hydrogens summed into heavy atoms:
elementType: Cl N N N N N C C C C C C C C C C C C
charge: -0.019741 -0.017160 -0.122564 -0.017489 0.004591 -0.021378 0.107465 0.405300 -0.045415 -0.166180 -0.124269 0.112522 -0.007575 -0.003651 -0.006274 0.105867 -0.291825 0.107776
polarizability: 2.47227148e+02 3.54027010e+00 1.70460302e+02 -1.17650401e+01 5.79011777e+00 1.24946072e+02
1716.lowfreq: -6.1676 -0.0004 -0.0003 0.0015 2.9748 4.3102 16.1109 31.5579 36.1014
frequency: 15.2523 31.4443 36.0885 50.9867 80.2259 99.2925 122.9958 166.8087 173.9818 177.3604 205.3992 224.8751 235.4644 281.6439 294.9423 334.3075 370.5060 403.4253 437.9522 472.5018 489.8857 539.0491 554.5411 561.9201 597.8452 616.6818 629.8915 645.8889 667.8630 702.5565 705.9270 750.4653 789.6741 794.1583 825.5495 855.6526 885.1664 916.9838 924.1811 980.3351 990.5589 998.4234 1003.6993 1018.6627 1041.4121 1068.2469 1099.4284 1116.2371 1124.6935 1130.5641 1151.1232 1174.2286 1192.5523 1204.4724 1211.6334 1223.6019 1292.4049 1317.9052 1343.6403 1364.5499 1374.0169 1382.8273 1384.5944 1432.7556 1437.6421 1457.5397 1474.2085 1477.1147 1481.9700 1485.6403 1489.2205 1514.2045 1539.6975 1593.0866 1599.6647 1615.4269 2987.7551 2988.4926 3009.6980 3067.1930 3086.0667 3097.5820 3110.7736 3122.6707 3129.1661 3142.0507 3152.5507 3166.0431 3549.6945 3579.4041
redmass: 4.2475 3.9390 5.6875 1.0341 4.1271 4.2744 4.8197 5.1821 9.1090 5.6842 3.9376 5.3568 3.7481 1.2072 3.5275 4.8606 4.8418 2.8064 5.4198 3.1880 5.7173 3.7051 1.1653 4.6035 1.2557 6.3395 4.9596 6.6571 5.5303 9.6795 1.8494 2.1056 11.5527 2.5641 5.8704 1.2467 6.8056 2.5799 1.3753 1.3889 6.0920 1.3200 3.0695 2.2534 1.6119 2.1758 2.0542 4.5249 1.2850 3.1042 2.3380 1.0509 1.1177 3.1919 2.1727 3.5506 1.8487 1.3373 1.3728 2.6421 2.2722 2.3511 1.7923 1.2665 2.1950 1.0415 1.0812 1.6688 1.1938 2.1241 1.1460 2.5526 7.8230 6.0800 6.1881 6.0195 1.0362 1.0347 1.0824 1.1011 1.1000 1.0998 1.1008 1.0852 1.0874 1.0926 1.0953 1.1013 1.0771 1.0776
irintensity: 0.0110 0.1574 0.0286 0.0031 0.8355 3.0083 0.3870 0.5100 5.5025 1.0421 3.1631 0.2676 1.0693 0.3091 0.2963 10.7749 10.9332 0.7067 1.2352 2.1366 11.1613 22.1600 120.5207 2.7844 75.3371 0.4144 3.9476 27.7991 9.4534 1.8678 50.6320 24.8656 30.5208 14.1793 61.7031 0.1655 18.8991 11.8833 1.9570 0.2563 0.1882 0.0104 15.1281 26.4378 1.8479 15.4484 24.9562 80.1186 2.0622 96.8980 28.2522 0.0764 5.8895 40.9243 29.8441 29.3009 59.9469 17.0234 31.0553 207.9885 122.7930 11.7648 21.0666 95.6409 14.1054 16.0665 17.4954 106.8252 64.0130 23.5687 21.9264 2.6895 1685.0261 18.5878 329.5372 6.4881 18.1797 52.9162 10.9527 28.2239 30.0278 29.0916 26.8853 4.6083 0.6743 20.8861 35.0738 20.3058 73.6961 84.6597
temp: 298.150 k
press: 1.00000 atm
elementType: 17 7 7 7 7 7 6 6 6 6 6 6 6 6 6 6 6 6 1 1 1 1 1 1 1 1 1 1 1 1 1 1
symmnumber: 1
zpe: 655831.5 jmol-1
zpe.correction: 0.249793 hartree
zpe.thermalcorrener: 0.266974 hartree
zpe.thermalcorrenthalpy: 0.267918 hartree
zpe.thermalcorrgfe: 0.201862 hartree
zpe.sumelectzpe: -1198.208435 hartree
zpe.sumelectthermal: -1198.191254 hartree
zpe.sumelectthermalent: -1198.190310 hartree
zpe.sumelectthermalfe: -1198.256366 hartree
dipole: -3.3483 4.5418 -0.3187
dipole: 5.6516
quadrupole: -110.9637 -107.9636 -107.9536
quadrupole: 18.1725 -4.6819 0.7528
quadrupole: -2.0034 0.9967 1.0067 18.1725 -4.6819 0.7528
hfenergy: -1198.4582283 hartree
pointgroup: C01 [X(C12H14Cl1N5)]
dipole: -1.5791849 0.7376685 1.3805724 debye
polarizability: 240.4871058|28.9375335|137.6343207|1.1657102|17.8813481|164.5120954 unknown
InChI: InChI=1S/C12H14ClN5/c1-8(9-6-4-3-5-7-9)15-12-17-10(13)16-11(14-2)18-12/h3-8,14-15H,1-2H3
charge 0 multiplicity 1
32 atoms
Cl 4.626709 -0.624546 -1.993759
N  -0.091197 -0.75147 -0.266734
N  1.347659 0.785673 0.800406
N  2.114419 -0.653504 -1.027548
N  2.910904 2.283207 1.729235
N  3.658949 0.909852 -0.005287
C  -1.248148 -0.422601 0.599927
C  -2.53043 -0.447552 -0.245699
C  -1.265578 -1.3262 1.852756
C  -3.677466 -1.190116 0.126181
C  -2.578104 0.323607 -1.438411
C  1.144971 -0.185932 -0.146722
C  -4.844819 -1.164103 -0.67299
C  -3.740211 0.351177 -2.237424
C  -4.881319 -0.394601 -1.856415
C  2.614471 1.303694 0.825649
C  3.307857 -0.05399 -0.874224
C  1.939679 2.826378 2.682206
H  -1.065552 0.614651 0.940899
H  -2.067704 -1.021383 2.548776
H  -0.301749 -1.230295 2.380412
H  -1.413618 -2.388645 1.58771
H  -0.181712 -1.484638 -0.973748
H  -3.670022 -1.794128 1.039168
H  -1.694841 0.900263 -1.738602
H  -5.72288 -1.745847 -0.370453
H  -3.758366 0.952034 -3.153578
H  -5.785232 -0.375266 -2.475328
H  3.869803 2.630914 1.69893
H  1.09632 3.314039 2.160451
H  2.445315 3.56877 3.320527
H  1.521492 2.026852 3.319088
