program: Gaussian 09
title: 000183311
version: EM64L-G09RevD.01
frameworkgroup: C1[X(C12H22O4)]
method: RPBEPBE
basis: SDD
operation: Freq
keyword: #pfreq=noraman
keyword: PBEPBE/SDD
title: #p freq=noraman PBEPBE/SDD
converged: NO YES NO NO
title: Mulliken charges:
elementType: O O O O C C C C C C C C C C C C H H H H H H H H H H H H H H H H H H H H H H
charge: -0.342864 -0.274494 -0.472180 -0.445627 0.426437 -0.553096 -0.498368 -0.150732 0.022157 -0.478178 -0.025946 -0.368992 -0.406856 -0.398506 -0.418609 -0.705692 0.245116 0.219252 0.223049 0.211877 0.232122 0.208879 0.224480 0.224644 0.233743 0.217437 0.203480 0.234911 0.200573 0.196742 0.200754 0.234801 0.218757 0.370939 0.211609 0.222386 0.218436 0.337558
chargesum: 0.00000
title: Mulliken charges with hydrogens summed into heavy atoms:
elementType: O O O O C C C C C C C C C C C C
charge: -0.342864 -0.274494 -0.101241 -0.108069 0.426437 -0.088728 -0.063442 0.081390 0.231036 -0.029054 0.207797 0.051925 0.028628 -0.001010 0.034949 -0.053261
polarizability: 1.68516306e+02 2.11418076e+00 1.26622096e+02 -1.65387343e+00 -3.83025723e+00 1.18858836e+02
1716.lowfreq: -13.0420 0.0003 0.0005 0.0006 7.5309 15.2875 38.7896 49.7714 82.4476
frequency: 37.8574 49.7109 82.4247 92.2257 128.5098 138.3218 169.5792 177.6229 198.8069 232.5668 243.9108 255.2063 264.3259 272.6190 290.5457 340.6415 354.7361 410.1380 417.9423 426.5707 459.8804 472.6236 504.1204 552.5474 571.5137 607.3737 614.4146 674.8300 719.2209 732.3424 758.3749 818.0126 829.0061 856.4115 881.9362 894.7973 919.6637 952.1077 959.6759 964.6716 973.6493 980.4886 1004.0359 1017.4681 1027.1042 1049.7949 1058.3173 1068.3396 1078.3878 1104.2480 1123.9310 1139.9211 1154.8892 1164.7385 1176.9176 1189.3132 1207.3605 1230.8640 1238.6938 1253.2563 1262.1778 1274.9151 1283.6904 1301.2176 1313.6359 1320.3124 1323.3061 1332.1156 1337.7629 1343.0673 1355.8091 1359.6664 1364.8700 1368.5483 1384.2112 1391.0543 1426.2388 1433.4661 1450.4144 1452.2974 1467.3508 1468.9486 1470.8700 1472.9500 1479.5990 1487.2609 2959.0233 2962.0352 2962.4066 2978.6710 2978.9154 2991.6310 2992.2463 2998.9625 2999.7424 3007.0812 3012.5627 3023.6800 3052.0385 3064.5866 3072.0468 3073.0445 3073.8686 3075.3436 3078.9884 3086.5361 3350.3510 3579.7533
redmass: 3.5680 3.6570 2.4690 2.6203 4.5914 3.6612 2.6443 3.5269 2.0279 2.1492 1.8033 2.8438 1.3675 2.6066 3.4829 3.0978 2.7037 2.9725 2.2167 2.2585 3.3354 4.1161 3.6475 3.3111 3.6424 2.9734 1.1436 4.3876 3.4369 3.1296 1.3841 2.0191 2.2902 2.4503 1.8206 1.7157 1.9179 4.2945 3.8941 1.8641 3.4026 2.2045 2.1671 1.7955 2.4658 2.3995 2.0029 2.0054 2.1414 2.0187 2.4182 1.9861 2.2019 2.5784 1.3933 1.4014 1.3291 1.3475 1.2910 1.4231 1.2592 1.2112 1.2389 1.4504 1.3798 1.2891 1.2702 1.2303 1.4255 1.3808 1.4948 1.6664 1.3036 1.4856 1.3457 1.2080 1.1879 1.0977 1.0856 1.0852 1.0807 1.0780 1.0769 1.0802 1.0534 1.0564 1.0666 1.0704 1.0694 1.0652 1.0365 1.0693 1.0600 1.0623 1.0730 1.0656 1.1000 1.0819 1.1001 1.1028 1.1009 1.1040 1.1006 1.1019 1.0996 1.0967 1.0665 1.0668
irintensity: 0.2461 0.3719 3.9758 6.6943 1.8985 2.0541 5.4104 0.7390 0.7095 9.0274 15.1540 29.3059 136.9628 7.0775 9.1889 2.4681 3.2365 1.1312 3.3821 2.4222 1.8996 9.3028 6.5197 4.6628 0.8352 5.4019 95.5376 7.3708 7.3245 44.7948 0.1161 4.4227 27.8686 5.3252 26.3831 19.4524 25.3814 48.2032 104.4793 13.7291 81.5238 28.4562 33.0535 2.1408 39.9770 33.7755 71.4118 26.4847 11.4504 7.3388 35.4245 19.8182 14.4786 22.5762 2.6746 5.2304 4.1908 16.6234 1.0147 2.9356 5.8653 3.1563 0.3552 18.2057 0.1901 12.1009 3.9010 4.9729 0.1351 4.9602 2.2531 31.7058 9.8494 1.2228 3.9045 11.9571 72.8710 11.7279 14.5533 2.1502 7.7795 5.2595 3.5971 7.8296 8.0352 14.6815 16.2094 28.7681 15.3834 67.8014 28.1489 4.7784 42.9908 12.3077 36.2697 19.1187 27.1768 71.0574 31.6433 14.9082 16.0476 17.5958 57.4606 55.7966 60.2387 20.3741 229.6236 9.2476
temp: 298.150 k
press: 1.00000 atm
elementType: 8 8 8 8 6 6 6 6 6 6 6 6 6 6 6 6 1 1 1 1 1 1 1 1 1 1 1 1 1 1 1 1 1 1 1 1 1 1
symmnumber: 1
zpe: 866507.7 jmol-1
zpe.correction: 0.330035 hartree
zpe.thermalcorrener: 0.346674 hartree
zpe.thermalcorrenthalpy: 0.347619 hartree
zpe.thermalcorrgfe: 0.286495 hartree
zpe.sumelectzpe: -770.048473 hartree
zpe.sumelectthermal: -770.031834 hartree
zpe.sumelectthermalent: -770.030890 hartree
zpe.sumelectthermalfe: -770.092013 hartree
dipole: -3.9104 -0.1469 -0.4359
dipole: 3.9374
quadrupole: -107.6740 -92.9012 -103.3378
quadrupole: 2.7176 -1.5553 -8.3909
quadrupole: -6.3697 8.4032 -2.0335 2.7176 -1.5553 -8.3909
hfenergy: -770.3785088 hartree
pointgroup: C01 [X(C12H22O4)]
dipole: 1.5412927 -0.0709344 -0.1380207 debye
polarizability: 168.5671846|1.719266|127.9181731|1.6828019|-1.3234781|117.5118801 unknown
InChI: InChI=1S/C12H22O4/c1-2-9-3-4-12(15-7-9)5-11(14)10(6-13)8-16-12/h9-11,13-14H,2-8H2,1H3
charge 0 multiplicity 1
38 atoms
O  0.467185 0.046479 1.048898
O  -0.334728 -0.114179 -1.230463
O  -2.11965 0.033529 1.912267
O  -4.390754 1.528176 -1.425518
C  0.090829 -0.880414 -0.058788
C  -1.055472 -1.734052 0.52186
C  1.314349 -1.694934 -0.507733
C  -2.324372 -0.891691 0.783351
C  2.863781 0.154704 0.337358
C  2.524652 -0.792446 -0.840919
C  -2.733897 -0.127844 -0.508224
C  1.597418 0.946206 0.715973
C  -1.546623 0.712344 -1.010178
C  4.020837 1.135094 0.015839
C  -3.981038 0.741185 -0.244333
C  5.386211 0.444244 -0.196066
H  -0.715905 -2.197808 1.465086
H  -1.280353 -2.540185 -0.200694
H  1.027256 -2.298863 -1.387521
H  1.574276 -2.390937 0.31265
H  -3.155607 -1.549854 1.097331
H  3.153824 -0.461269 1.215437
H  3.394291 -1.427859 -1.089551
H  2.290395 -0.184744 -1.736538
H  -2.980084 -0.877238 -1.287574
H  1.747627 1.546773 1.629254
H  1.299475 1.612191 -0.119804
H  -1.7522 1.148712 -2.000418
H  -1.318844 1.522727 -0.285243
H  4.114446 1.866233 0.845528
H  3.758156 1.721067 -0.889211
H  -3.803135 1.385564 0.639125
H  -4.846261 0.090147 -0.029923
H  -1.150819 0.289371 1.897519
H  5.669717 -0.152944 0.691042
H  5.370371 -0.233311 -1.068475
H  6.183437 1.189755 -0.369577
H  -3.860596 2.362471 -1.461372
