program: Gaussian 09
title: 000183378
version: EM64L-G09RevD.01
frameworkgroup: C1[X(C24H21N5O2S)]
method: RPBEPBE
basis: SDD
operation: Freq
keyword: #p
keyword: freq=noraman
keyword: PBEPBE/SDD
title: #p freq=noraman PBEPBE/SDD
converged: YES YES NO NO
title: Mulliken charges:
elementType: S O O N N N N N C C C C C C C C C C C C C C C C C C C C C C C C H H H H H H H H H H H H H H H H H H H H H
charge: 1.071025 -0.549095 -0.527413 -0.531868 -0.048733 -0.412375 -0.015669 -0.793108 0.243685 0.264959 -0.236908 0.231963 0.331350 -0.078253 0.219619 -0.324819 -0.097255 0.258092 -0.379894 -0.367644 -0.326141 -0.286922 -0.315130 0.601351 -0.552654 -0.487761 -0.277056 -0.235556 -0.187953 -0.369195 -0.638538 -0.726330 0.300031 0.262772 0.261384 0.203725 0.264415 0.259601 0.293130 0.305013 0.239919 0.228982 0.233260 0.310630 0.362428 0.228751 0.240120 0.235293 0.225547 0.238856 0.279354 0.287853 0.283164
chargesum: 0.00000
title: Mulliken charges with hydrogens summed into heavy atoms:
elementType: S O O N N N N N C C C C C C C C C C C C C C C C C C C C C C C C
charge: 1.071025 -0.549095 -0.527413 -0.231837 -0.048733 -0.101744 -0.015669 -0.430680 0.243685 0.264959 -0.236908 0.231963 0.331350 -0.078253 0.219619 -0.062047 -0.097255 0.258092 -0.118510 -0.163918 -0.061726 -0.027322 -0.022000 0.601351 -0.247641 -0.247842 -0.048074 -0.002296 0.040798 -0.129075 0.061157 0.124040
polarizability: 5.27044612e+02 -2.77579251e+00 4.36308085e+02 -2.45337983e+01 -3.31083210e+00 2.19645345e+02
1716.lowfreq: -6.9589 -0.0016 -0.0013 -0.0011 1.8443 4.4764 7.8849 19.4138 23.5585
frequency: 6.0836 19.2401 23.5404 25.7989 44.5058 63.1162 68.0123 82.8276 101.8103 118.7319 128.9907 134.5458 153.3139 164.8941 168.8645 174.7068 186.0621 192.2066 206.0592 238.2277 248.6444 256.8544 280.2872 284.4990 292.0398 307.7176 320.7467 326.8742 340.4143 346.2364 370.6440 403.0721 414.6295 432.4570 435.8394 446.8156 457.2394 484.8479 509.8848 520.8806 532.0338 543.8356 550.9844 561.9834 569.4446 582.7935 585.5620 608.1596 614.4222 641.4246 647.1187 651.8611 678.5876 689.0697 710.3327 732.8965 754.3159 757.6262 761.6423 772.2800 787.1146 796.6170 804.2425 808.1324 835.0065 843.5626 845.7201 867.2153 873.5196 883.6311 900.8642 908.5472 932.3899 952.5040 953.5276 963.4362 966.6769 980.1584 984.9092 991.6167 1008.1504 1022.1802 1026.9626 1030.7132 1056.5357 1066.6128 1100.6508 1115.9718 1126.2510 1137.9417 1156.7734 1164.5942 1179.1234 1202.9978 1209.7864 1229.7567 1234.1943 1245.8466 1251.7355 1282.6256 1287.4903 1300.9600 1304.8989 1320.5236 1333.9440 1346.1558 1367.7442 1374.8110 1388.3426 1395.7872 1412.2626 1412.3802 1418.0831 1427.4388 1434.2032 1441.8569 1448.1145 1458.0701 1468.5201 1471.1440 1476.9708 1486.9868 1501.3533 1522.6175 1527.2149 1551.5292 1560.3812 1581.6346 1586.7776 1601.8428 1621.4588 1623.5314 2949.9130 3032.4379 3032.5874 3098.4675 3109.1334 3123.3051 3136.1957 3139.8764 3153.8303 3153.9553 3157.2866 3159.9033 3162.2152 3169.9622 3175.1186 3179.6472 3180.9266 3190.8696 3468.7269 3524.2699 3529.9918
redmass: 6.3433 4.5633 5.9015 5.4774 5.0787 5.4315 5.3745 5.9487 4.3492 4.2423 4.2943 4.2433 4.6715 3.5734 1.7923 1.4437 2.0368 3.5696 4.6405 4.7165 2.6981 3.9475 4.2113 4.5457 5.3173 3.2073 1.7995 5.8527 6.0912 4.2973 5.3217 3.8983 3.6797 3.5682 2.0670 3.0630 5.4274 3.7030 3.7312 6.7704 4.0707 4.2149 5.6534 5.4636 5.2575 7.3423 3.3421 3.7182 3.4745 3.1709 4.4151 2.5444 4.9228 5.1440 3.4262 3.8238 3.6754 5.3687 1.8225 2.2867 2.0158 2.4948 1.8250 10.4497 2.2788 3.0838 2.8273 1.9249 1.5900 4.9857 2.8165 5.4023 1.3958 1.3855 1.4278 5.2111 2.9471 1.3172 1.3214 1.3322 1.3618 1.9302 2.1114 2.5776 3.2918 2.6697 2.1518 1.4093 1.4056 1.2407 1.4517 1.5264 1.3527 2.0890 1.6545 2.0013 2.0423 2.1833 2.6006 1.6756 1.7937 1.8617 1.3741 2.1379 4.0116 2.3490 3.4656 3.2062 3.9973 2.3394 2.7062 1.0544 1.0592 2.9724 1.6824 3.2035 1.8163 2.2695 1.7538 1.1188 3.6472 2.9999 1.1645 3.3889 5.8876 7.3112 4.6740 6.6141 5.0020 6.5200 6.3780 6.4787 1.0427 1.0752 1.0412 1.0982 1.0870 1.0892 1.0879 1.0875 1.0915 1.0937 1.0870 1.0935 1.0951 1.0997 1.0982 1.0971 1.1075 1.1081 1.0737 1.0777 1.0763
irintensity: 2.0924 0.7777 0.6179 1.6247 2.6898 0.2851 2.7906 1.5573 1.3737 2.4199 1.1234 10.4628 13.7816 5.5918 5.2273 2.5343 9.8617 9.5676 0.8968 8.0881 6.9221 8.9829 11.7286 5.2984 4.9271 50.4376 82.6657 4.5886 9.1241 38.6157 10.1259 39.3809 5.2123 9.0257 34.7386 32.6927 16.0378 27.2844 2.0576 6.8100 6.5908 3.1610 16.9747 28.1273 36.2390 6.8147 5.5998 46.9918 28.2166 22.4117 8.3729 42.3493 14.6670 75.8813 5.9115 14.9513 72.2449 44.4257 55.8789 6.9813 17.4781 14.9682 19.9719 99.4891 24.8802 29.4545 26.4611 1.9582 55.8592 0.7152 29.2844 4.5841 0.6053 0.5975 0.0584 14.2767 38.5749 162.3165 0.8520 0.4012 1.9528 63.7373 7.4839 0.5669 4.7120 12.9905 9.1526 0.9496 15.9771 5.4897 17.0942 17.5364 0.2653 86.3662 21.4144 21.1266 15.4777 0.8395 8.7517 12.4082 40.8299 7.1891 6.2179 16.1318 78.1437 13.8627 177.0690 67.5139 24.4262 45.3306 24.3238 7.3416 7.5627 8.8895 148.1265 18.8400 19.8518 69.0785 74.7594 21.2764 85.6442 328.3389 30.0018 212.0302 10.9222 87.2655 49.4935 6.3334 55.7375 41.1254 94.8457 135.9852 85.6754 29.0443 7.5479 23.8290 11.3260 26.0792 11.5324 9.5947 34.4843 9.4614 1.8032 5.4379 2.6614 32.7057 23.2526 7.3874 0.1565 0.1729 37.0445 59.9827 40.8831
temp: 298.150 k
press: 1.00000 atm
elementType: 16 8 8 7 7 7 7 7 6 6 6 6 6 6 6 6 6 6 6 6 6 6 6 6 6 6 6 6 6 6 6 6 1 1 1 1 1 1 1 1 1 1 1 1 1 1 1 1 1 1 1 1 1
symmnumber: 1
zpe: 1057145.8 jmol-1
zpe.correction: 0.402646 hartree
zpe.thermalcorrener: 0.431257 hartree
zpe.thermalcorrenthalpy: 0.432201 hartree
zpe.thermalcorrgfe: 0.340638 hartree
zpe.sumelectzpe: -1747.042726 hartree
zpe.sumelectthermal: -1747.014115 hartree
zpe.sumelectthermalent: -1747.013171 hartree
zpe.sumelectthermalfe: -1747.104733 hartree
dipole: -0.0139 7.0814 -0.5218
dipole: 7.1006
quadrupole: -207.7297 -189.3825 -188.1968
quadrupole: -24.0988 0.9625 5.5716
quadrupole: -12.6267 5.7205 6.9062 -24.0988 0.9625 5.5716
hfenergy: -1747.4453716 hartree
pointgroup: C01 [X(C24H21N5O2S1)]
dipole: -0.6661279 -2.6985412 -0.2799136 debye
polarizability: 522.5412795|-22.7263096|436.5774084|23.7594277|29.0930808|223.8793539 unknown
InChI: InChI=1S/C24H21N5O2S/c1-25-22-14-15(29-32(2,30)31)9-11-21(22)28-24-17-6-3-4-8-20(17)27-23-16-7-5-13-26-19(16)12-10-18(23)24/h3-14,25,28-29H,1-2H3
charge 0 multiplicity 1
53 atoms
S  -6.255051 2.236432 0.855035
O  -6.905211 3.277561 1.9175
O  -6.215414 2.572245 -0.736357
N  -0.481951 -1.272191 -0.689895
N  3.714196 -1.529315 0.181838
N  -2.510732 -0.31481 -2.319421
N  4.105363 3.343653 0.281549
N  -4.614653 1.933012 1.548718
C  0.882721 -1.322409 -0.354857
C  1.684812 -0.144889 -0.200467
C  3.097135 -0.317883 0.096701
C  1.514704 -2.614949 -0.233618
C  3.932817 0.872329 0.281677
C  2.94788 -2.656607 0.004551
C  -1.483926 -0.417895 -0.113499
C  1.171274 1.197199 -0.389066
C  3.367423 2.18297 0.121034
C  -2.547578 0.028636 -0.967101
C  1.972659 2.311803 -0.236666
C  0.801443 -3.859016 -0.319106
C  3.60697 -3.930149 0.079649
C  -1.477582 -0.048684 1.246485
C  5.313373 0.776692 0.613776
C  -3.578197 1.160265 0.956433
C  -3.594826 0.817028 -0.418246
C  -2.512968 0.733151 1.795751
C  1.46944 -5.081799 -0.233541
C  2.889412 -5.118151 -0.046624
C  6.060824 1.952275 0.777659
C  5.413924 3.210106 0.602981
C  -3.511598 0.14914 -3.282186
C  -7.070592 0.519827 1.043012
H  -0.854944 -2.132259 -1.105321
H  0.120914 1.331251 -0.656822
H  1.583828 3.323919 -0.382123
H  -0.291467 -3.868961 -0.415061
H  4.688466 -3.920685 0.246095
H  -0.659305 -0.394858 1.886653
H  5.750905 -0.218602 0.730718
H  -4.366765 1.235048 -1.069907
H  -2.51094 0.985585 2.86082
H  0.905128 -6.018748 -0.292136
H  3.403793 -6.083369 0.014456
H  -1.595858 -0.596405 -2.678045
H  -4.418895 2.59195 2.309496
H  7.124092 1.917713 1.034882
H  5.974635 4.144705 0.726024
H  -4.520996 -0.203991 -3.000733
H  -3.274308 -0.262987 -4.27664
H  -3.550745 1.255717 -3.363236
H  -7.111252 0.325095 2.122407
H  -8.066297 0.617543 0.588542
H  -6.428281 -0.190637 0.504827
