program: Gaussian 09
title: 000183327
version: EM64L-G09RevD.01
frameworkgroup: C1[X(C17H24ClN5)]
method: RPBEPBE
basis: SDD
operation: Freq
keyword: #p
keyword: freq=noraman
keyword: PBEPBE/SDD
title: #p freq=noraman PBEPBE/SDD
converged: YES YES NO NO
title: Mulliken charges:
elementType: Cl N N N N N C C C C C C C C C C C C C C C C C H H H H H H H H H H H H H H H H H H H H H H H H
charge: -0.033252 -0.170647 -0.355079 -0.144687 -0.027076 -0.010075 -0.013192 -0.009869 -0.700327 -0.693688 -0.694817 -0.693861 0.203584 -0.152636 0.071475 0.408616 -0.722119 -0.413136 -0.377216 -0.333687 -0.234737 -0.232494 -0.238496 0.185625 0.179477 0.208616 0.265170 0.216249 0.216147 0.209154 0.257724 0.207919 0.277919 0.208143 0.207721 0.207902 0.277185 0.250722 0.333196 0.217476 0.242091 0.216308 0.244752 0.251537 0.226287 0.228978 0.231117
chargesum: 0.00000
title: Mulliken charges with hydrogens summed into heavy atoms:
elementType: Cl N N N N N C C C C C C C C C C C C C C C C C
charge: -0.033252 -0.170647 -0.021883 -0.144687 -0.027076 -0.010075 0.172433 0.169608 -0.010293 -0.010663 -0.000835 -0.001053 0.203584 0.098086 0.071475 0.408616 -0.046243 -0.168384 -0.125679 -0.333687 -0.008450 -0.003516 -0.007378
polarizability: 3.18428067e+02 3.39603115e+00 2.22838639e+02 6.21765348e+00 1.12860075e+01 1.77286469e+02
1716.lowfreq: -3.7900 -1.7769 -0.0022 -0.0021 -0.0014 3.3243 16.4359 21.6472 25.7407
frequency: 16.3039 21.3087 25.6796 38.1248 59.3241 66.6251 75.4364 86.6708 115.7374 137.3869 163.5654 177.4665 186.0750 192.9192 205.5518 215.0959 229.7561 230.7826 236.7336 243.4578 268.1407 276.8030 287.5544 312.9651 326.7645 361.9844 371.7221 403.7466 417.2194 454.8572 463.9324 472.4598 501.4349 504.5098 535.7782 560.1675 592.2632 605.4182 616.5319 644.7457 659.9218 704.1708 705.3306 747.8422 761.6940 785.6204 794.7747 834.2723 856.8153 865.7907 889.9510 906.7842 913.0981 919.5665 924.3480 934.8732 940.2930 951.4540 981.5211 990.6719 998.4297 1014.4976 1018.8304 1040.0425 1061.0898 1075.4166 1102.0433 1109.9818 1132.4518 1133.0341 1149.1382 1165.9699 1173.8461 1178.6632 1191.6277 1192.5333 1210.7005 1215.4695 1243.1934 1288.5067 1310.0092 1315.4365 1319.2041 1338.2479 1345.8776 1358.0695 1363.2046 1369.2942 1372.3632 1378.9238 1382.4975 1386.4714 1389.3748 1425.8259 1436.7425 1450.0352 1454.6760 1465.7791 1468.7239 1474.7457 1479.9454 1481.7751 1484.0992 1485.6412 1498.5063 1499.4468 1507.4711 1529.2406 1573.2998 1592.7948 1614.9380 2985.1264 2986.0025 2986.6421 2986.8890 2988.9748 2999.8987 3003.3247 3014.3170 3073.1093 3076.3930 3078.5351 3081.2170 3085.0879 3094.4590 3110.2719 3115.8765 3117.2745 3122.6338 3123.1982 3129.8700 3142.7226 3153.7340 3166.4536 3550.5837
redmass: 4.2799 3.7062 3.8368 5.3331 2.9957 2.9510 3.4247 3.6481 5.5002 5.4808 5.4271 4.1549 2.4562 1.2270 1.8140 2.2132 1.5011 2.3560 2.0482 1.2746 3.2290 1.8982 1.3834 4.3446 2.8621 2.9811 3.2915 2.8181 5.2647 3.6848 3.2482 3.3133 4.7217 3.4302 3.0003 4.9900 1.4411 2.2923 6.3439 7.0633 5.8613 8.5659 1.9475 2.4292 3.2456 11.5883 2.7576 3.1976 1.2471 3.3985 4.9163 2.3424 1.1525 1.1686 1.3706 1.4891 1.4763 2.9193 1.3846 6.1631 1.3118 2.9954 2.4244 1.6866 2.6434 2.4254 2.0223 1.7295 3.0932 2.3736 2.4388 2.7311 1.0509 2.5353 1.7593 1.3054 2.0231 3.3524 6.3440 1.9118 1.3747 1.3429 1.3473 1.3923 1.2470 1.8008 1.2191 1.2134 1.9385 1.3326 4.3755 1.2591 1.2355 2.7812 2.2028 1.0437 1.0447 1.0717 1.0686 1.0661 1.0658 1.1221 1.0653 1.9043 1.1612 1.1062 1.9272 6.5780 5.8289 6.1217 6.0147 1.0367 1.0366 1.0427 1.0365 1.0377 1.0786 1.0818 1.0820 1.0998 1.0998 1.0991 1.0992 1.1001 1.0997 1.0994 1.0988 1.0991 1.0985 1.0850 1.0876 1.0928 1.0951 1.1010 1.0771
irintensity: 0.0037 0.0261 0.1345 0.0770 0.4810 0.6155 0.1963 1.0722 0.0425 0.3104 0.8489 0.9223 0.1914 0.0965 0.5604 1.2663 0.3136 1.0800 0.7246 0.3811 7.1975 1.1525 1.2688 3.6039 0.0305 0.2987 6.8627 0.6975 4.5613 2.4770 0.6771 0.7112 8.5496 9.4381 25.9607 9.2066 75.1873 25.5986 0.4241 18.3821 2.9413 2.7740 39.2936 7.0317 97.2444 22.4347 9.1623 0.4913 0.2414 9.1571 15.8718 3.2117 1.1983 7.0111 0.8880 0.0012 0.1399 31.5257 0.2658 0.7447 0.3541 23.9340 19.6423 2.1739 9.2447 39.5877 22.9654 76.4857 98.2247 6.6096 15.5424 143.3208 0.1516 23.2437 25.3118 1.9781 18.6256 61.2782 26.6223 73.5678 0.4826 16.0362 7.1411 36.8745 9.3502 129.4095 15.9003 46.7813 354.1247 22.6795 13.1062 33.1000 82.0747 193.7687 18.0490 0.1935 3.2465 25.0099 19.2365 14.3738 2.3995 11.2670 2.4565 23.8370 60.4401 6.0259 86.4205 1690.1217 246.8048 10.3255 5.7816 20.8899 46.6219 36.1591 17.5879 26.1413 1.3805 11.0099 75.1138 9.1554 25.3335 80.0407 29.4306 33.7343 35.4955 3.4274 28.7397 3.4863 24.3220 3.7378 1.2078 23.6673 34.4172 20.0388 74.5426
temp: 298.150 k
press: 1.00000 atm
elementType: 17 7 7 7 7 7 6 6 6 6 6 6 6 6 6 6 6 6 6 6 6 6 6 1 1 1 1 1 1 1 1 1 1 1 1 1 1 1 1 1 1 1 1 1 1 1 1
symmnumber: 1
zpe: 1017977.3 jmol-1
zpe.correction: 0.387727 hartree
zpe.thermalcorrener: 0.411781 hartree
zpe.thermalcorrenthalpy: 0.412725 hartree
zpe.thermalcorrgfe: 0.331954 hartree
zpe.sumelectzpe: -1394.318229 hartree
zpe.sumelectthermal: -1394.294175 hartree
zpe.sumelectthermalent: -1394.293231 hartree
zpe.sumelectthermalfe: -1394.374002 hartree
dipole: -1.9416 -5.1246 0.0373
dipole: 5.4802
quadrupole: -129.5985 -153.1022 -140.5151
quadrupole: -13.1851 3.0453 2.9434
quadrupole: 11.4734 -12.0303 0.5568 -13.1851 3.0453 2.9434
hfenergy: -1394.7059565 hartree
pointgroup: C01 [X(C17H24Cl1N5)]
dipole: 1.1131052 -1.6231237 0.8804416 debye
polarizability: 316.3241122|5.9606385|200.0336423|-14.4193813|-26.4086318|202.1954199 unknown
InChI: InChI=1S/C17H24ClN5/c1-11(2)23(12(3)4)17-21-15(18)20-16(22-17)19-13(5)14-9-7-6-8-10-14/h6-13,19H,1-5H3
charge 0 multiplicity 1
47 atoms
Cl -3.385862 3.087626 -1.416532
N  -2.531195 -1.330801 0.895611
N  1.19261 1.314779 -0.341416
N  -0.620141 -0.045268 0.315622
N  -2.86488 0.753559 -0.184288
N  -0.952474 2.098487 -0.819149
C  -1.66056 -2.403053 1.500129
C  -4.025397 -1.557251 0.922986
C  -0.847449 -1.901049 2.716599
C  -0.782761 -3.117588 0.445861
C  -4.640271 -1.669272 -0.491773
C  -4.765003 -0.531359 1.813528
C  -1.990528 -0.200454 0.33794
C  2.218624 0.415516 0.23268
C  -0.155961 1.098155 -0.265687
C  3.436325 0.372412 -0.703653
C  2.529542 0.803693 1.696411
C  4.763334 0.530528 -0.234642
C  3.230614 0.134625 -2.089586
C  -2.261949 1.822721 -0.720555
C  5.858824 0.45382 -1.126483
C  4.321066 0.058148 -2.981365
C  5.643185 0.217316 -2.501884
H  -2.382794 -3.149239 1.881722
H  -4.132784 -2.547853 1.40452
H  -0.342557 -2.758583 3.198772
H  -0.087144 -1.170524 2.400607
H  -1.509903 -1.426341 3.462793
H  -1.402042 -3.513893 -0.378972
H  -0.254384 -3.965867 0.918814
H  -0.036987 -2.424385 0.027109
H  -5.699382 -1.975056 -0.405517
H  -4.592033 -0.701075 -1.012337
H  -4.110481 -2.429596 -1.094195
H  -4.331571 -0.504394 2.829958
H  -5.828425 -0.821639 1.900204
H  -4.707979 0.475111 1.371972
H  1.747611 -0.586479 0.247395
H  1.477725 2.199673 -0.766786
H  3.202415 0.066207 2.170088
H  1.589557 0.82648 2.273536
H  2.999866 1.801575 1.760556
H  4.952979 0.716794 0.82722
H  2.207479 0.015174 -2.465555
H  6.878614 0.580491 -0.745719
H  4.142198 -0.125233 -4.046782
H  6.491826 0.159165 -3.192457
