program: Gaussian 09
title: 000183264
version: EM64L-G09RevD.01
frameworkgroup: C1[X(C13H12Cl2N6O2)]
method: RPBEPBE
basis: SDD
operation: Freq
keyword: #p
keyword: freq=noraman
keyword: PBEPBE/SDD
title: #p freq=noraman PBEPBE/SDD
converged: NO NO NO NO
title: Mulliken charges:
elementType: Cl Cl O O N N N N N N C C C C C C C C C C C C C H H H H H H H H H H H H
charge: 0.034403 0.034405 -0.228249 -0.228253 -0.165757 -0.115222 -0.009349 -0.009416 0.017013 0.116261 -0.403330 -0.403417 -0.389152 -0.388872 0.454083 0.195512 -0.328908 -0.328967 -0.385655 -0.385555 0.392022 -0.267266 -0.267281 0.244261 0.234180 0.244255 0.234175 0.279142 0.244420 0.279060 0.244452 0.243687 0.243613 0.284851 0.284854
chargesum: 0.00000
title: Mulliken charges with hydrogens summed into heavy atoms:
elementType: Cl Cl O O N N N N N N C C C C C C C C C C C C C
charge: 0.034403 0.034405 -0.228249 -0.228253 -0.165757 -0.115222 -0.009349 -0.009416 0.017013 0.116261 0.075112 0.075013 0.134411 0.134639 0.454083 0.195512 -0.085221 -0.085354 -0.100804 -0.100701 0.392022 -0.267266 -0.267281
polarizability: 4.15958333e+02 2.28102176e-02 2.06514773e+02 -2.08407597e-02 1.51434767e+01 1.13341703e+02
1716.lowfreq: -5.4957 -3.7275 -0.0017 -0.0016 -0.0009 4.1140 5.9976 31.1549 37.9160
frequency: -3.7512 31.0810 37.9095 69.4062 76.5200 90.3047 106.8498 128.7459 133.9373 140.4037 146.2038 182.7899 213.3230 214.7433 230.3139 273.0692 277.4662 319.9990 331.5833 344.0937 392.9684 423.9524 427.5543 437.9694 478.2425 492.2263 500.7207 522.4605 560.3449 598.1552 618.5648 622.4723 625.5208 664.1115 665.1400 705.6437 731.3605 767.5516 781.5052 787.8653 791.0308 808.0865 827.1602 861.2803 878.2948 920.2186 963.0807 977.0891 978.3568 980.6317 991.0990 1047.1321 1078.0854 1078.1670 1082.2265 1099.1155 1122.4600 1153.1506 1178.3576 1183.2842 1188.0886 1203.5965 1216.7000 1235.4958 1244.8709 1267.3747 1270.3925 1295.9939 1309.4121 1341.6898 1346.5782 1360.8961 1361.9979 1365.1908 1386.3334 1393.9410 1400.0775 1450.3164 1469.5465 1479.0830 1479.9564 1490.6395 1492.1586 1509.3951 1564.2834 1576.6560 1621.5801 2953.1131 2957.9855 2992.9783 2993.7583 3044.8071 3045.5040 3088.2890 3088.8892 3158.8902 3159.7276 3182.4907 3185.3343
redmass: 7.7660 8.3374 6.0266 8.7633 6.3648 6.4874 3.5488 5.7361 7.4812 14.1673 9.9880 10.6477 16.2704 3.6424 6.9734 1.8060 5.1576 6.3757 8.7501 2.7445 16.9149 3.0341 7.2515 7.6685 5.0389 3.3237 3.2190 5.4398 7.4639 5.3348 8.8194 2.3492 7.0698 4.5240 11.2624 5.4231 4.7173 5.4929 12.2373 7.5820 12.1334 1.3201 1.7945 1.5568 12.1387 3.9458 1.9250 1.3880 2.7372 1.3488 3.1156 2.4548 2.2521 2.1750 2.1798 2.9256 1.3750 7.0496 3.3428 5.3207 2.0096 1.9885 1.3027 2.4384 1.8930 1.2465 1.7540 4.7032 1.3956 3.0457 1.6091 1.6039 1.4480 1.5108 2.4850 10.6200 4.2135 4.1957 2.7060 1.0942 1.5238 1.1566 1.0916 2.9140 8.7853 7.7634 6.2822 1.0672 1.0684 1.0660 1.0681 1.0951 1.0963 1.0955 1.0966 1.0885 1.0882 1.0953 1.0965
irintensity: 4.3147 2.3864 0.0389 0.7030 0.0085 0.8713 0.3568 2.7728 1.8988 0.8187 1.8401 0.0454 0.0113 10.6596 0.1470 0.4749 3.4960 3.6841 11.6199 0.3429 1.8702 1.9289 2.6111 5.0760 3.6053 6.5421 4.2446 5.0761 3.0394 11.1708 0.3643 2.9975 0.5486 22.3892 2.9521 7.7766 4.2951 16.7187 11.5033 4.6731 157.9871 0.0119 60.6565 8.0431 12.3604 15.8966 4.2953 3.2154 179.7394 0.0249 10.8634 3.7913 11.2758 4.6550 16.5004 18.4856 17.2894 144.5206 10.0548 769.8541 131.8160 40.8977 218.7656 303.1964 13.4578 0.0776 59.0173 66.0420 0.8077 80.6154 35.5724 19.2487 97.7167 17.6386 232.3302 485.1452 27.1846 2.9218 804.1853 8.6690 0.8615 50.9174 19.3291 76.2680 1090.4512 13.5486 369.9000 60.2521 34.0271 38.8180 16.1269 3.6808 31.7098 0.3723 9.3385 8.8250 9.2852 0.7731 10.0371
temp: 298.150 k
press: 1.00000 atm
elementType: 17 17 8 8 7 7 7 7 7 7 6 6 6 6 6 6 6 6 6 6 6 6 6 1 1 1 1 1 1 1 1 1 1 1 1
symmnumber: 1
zpe: 653911.1 jmol-1
zpe.correction: 0.249062 hartree
zpe.thermalcorrener: 0.268203 hartree
zpe.thermalcorrenthalpy: 0.269147 hartree
zpe.thermalcorrgfe: 0.200036 hartree
zpe.sumelectzpe: -1899.909705 hartree
zpe.sumelectthermal: -1899.890564 hartree
zpe.sumelectthermalent: -1899.889620 hartree
zpe.sumelectthermalfe: -1899.958730 hartree
dipole: -3.3916 0.0012 0.0088
dipole: 3.3916
quadrupole: -261.0627 -144.6867 -143.4932
quadrupole: 0.0096 0.0141 4.4077
quadrupole: -77.9818 38.3941 39.5877 0.0096 0.0141 4.4077
hfenergy: -1900.1587668 hartree
pointgroup: C01 [X(C13H12Cl2N6O2)]
dipole: 1.3343406 0.0005337 -0.0033727 debye
polarizability: 415.9583362|-0.0084476|206.3587824|-0.0002938|-15.6152022|113.4976905 unknown
InChI: InChI=1S/C13H12Cl2N6O2/c14-11-16-12(15)18-13(17-11)20-7-5-19(6-8-20)9-1-3-10(4-2-9)21(22)23/h1-4H,5-8H2
charge 0 multiplicity 1
35 atoms
Cl 6.242952 -2.657926 -0.393007
Cl 6.241959 2.657902 0.395894
O  -7.247691 -0.929402 0.670946
O  -7.248799 0.926773 -0.668603
N  -0.936359 -0.000562 -0.002643
N  1.975863 -0.000247 -0.002089
N  3.992769 1.207309 0.18846
N  3.993239 -1.207603 -0.189401
N  -6.636267 -0.000862 0.001293
N  6.085882 -0.00002 0.001311
C  -0.160918 -1.150495 0.512365
C  -0.160993 1.149285 -0.51798
C  1.205534 -1.253237 -0.18585
C  1.205208 1.252718 0.180659
C  -2.329385 -0.000493 -0.001754
C  3.337327 -0.000182 -0.00106
C  -3.068784 -0.989732 0.72915
C  -3.069992 0.988519 -0.731772
C  -4.469747 -0.991331 0.728194
C  -4.470953 0.989894 -0.7288
C  -5.168696 -0.000749 0.000234
C  5.331609 -1.118657 -0.166844
C  5.331187 1.118521 0.168204
H  -0.708739 -2.086165 0.299995
H  -0.022993 -1.08492 1.612043
H  -0.709007 2.084939 -0.306216
H  -0.022674 1.08323 -1.617573
H  1.78866 -2.092052 0.2266
H  1.0651 -1.450322 -1.266766
H  1.788299 2.091442 -0.232047
H  1.064334 1.450389 1.261409
H  -2.548104 -1.740384 1.329606
H  -2.55035 1.739112 -1.333185
H  -5.036417 -1.737531 1.291364
H  -5.038552 1.735942 -1.291235
