program: Gaussian 09
title: 000183249
version: EM64L-G09RevD.01
frameworkgroup: C1[X(C9H5BrN2O4)]
method: RPBEPBE
basis: SDD
operation: Freq
keyword: #p
keyword: freq=noraman
keyword: PBEPBE/SDD
title: #p freq=noraman PBEPBE/SDD
converged: YES YES NO NO
title: Mulliken charges:
elementType: Br O O O O N N C C C C C C C C C H H H H H
charge: 0.092484 -0.265952 -0.179357 -0.190413 -0.173573 0.032914 0.008845 0.436118 0.340811 -0.519271 -0.366911 0.450102 -0.355382 0.279324 -0.741129 -0.246321 0.316644 0.287088 0.278810 0.253359 0.261810
chargesum: 0.00000
title: Mulliken charges with hydrogens summed into heavy atoms:
elementType: Br O O O O N N C C C C C C C C C
charge: 0.092484 -0.265952 -0.179357 -0.190413 -0.173573 0.032914 0.008845 0.436118 0.340811 -0.202628 -0.366911 0.450102 -0.068294 0.279324 0.052851 -0.246321
polarizability: 2.11774895e+02 1.03869176e+01 1.65479475e+02 -9.55519013e+00 -2.52815922e+00 6.81173486e+01
1716.lowfreq: -2.7396 0.0005 0.0007 0.0010 3.6245 9.9474 29.0807 42.4448 66.5369
frequency: 29.0524 42.4355 66.5365 80.0662 108.3879 109.6704 116.4988 138.4861 152.7434 182.2017 253.1704 273.4528 295.8493 311.6243 356.2253 384.9271 440.5193 453.3291 476.1836 507.9489 524.0430 585.8302 608.5507 630.2140 683.2904 695.0044 699.3167 763.5525 789.2674 827.6322 912.8591 916.0597 944.0742 977.7818 1038.4512 1069.9490 1127.5262 1193.0736 1198.2138 1216.3843 1234.0481 1349.7749 1371.4090 1384.2870 1397.2021 1448.4007 1449.7084 1453.9501 1536.1499 1600.1110 1721.4148 2189.9532 3011.1750 3103.0922 3149.4417 3180.6219 3188.5126
redmass: 13.2693 7.9859 4.5258 5.4517 1.4008 14.2947 3.6290 9.3398 13.5656 4.8064 8.4866 11.2159 8.8455 6.6720 9.5834 11.7290 5.5456 6.5832 5.9915 5.9328 4.0545 8.3581 5.5518 4.4857 5.1193 9.2816 10.9075 7.2692 11.5404 8.9349 8.5792 1.5015 1.4507 2.4755 1.6269 3.1001 2.4339 3.0503 2.5958 2.6451 6.4057 3.8794 8.9009 1.2637 5.0953 1.0513 1.0975 3.8728 8.7484 7.4025 10.9620 12.6286 1.0375 1.0955 1.1021 1.0938 1.0932
irintensity: 0.2406 1.0095 2.0687 2.3933 1.6787 2.7753 2.3385 5.2224 0.7679 1.6633 1.7941 2.5506 0.7408 5.1281 0.1005 0.8278 3.6032 3.0118 3.1101 3.8632 7.3187 5.1986 43.6475 11.1739 30.2978 3.7699 30.2412 21.5093 49.6473 128.2138 24.2209 20.8438 19.7161 145.6605 7.9834 101.6443 354.3699 129.5335 90.0024 118.9309 50.9256 0.7635 96.2746 64.6442 10.4318 17.7293 36.1019 156.3869 4.1582 22.1481 156.3935 14.1410 0.3665 3.3730 6.3460 1.0660 11.3324
temp: 298.150 k
press: 1.00000 atm
elementType: 35 8 8 8 8 7 7 6 6 6 6 6 6 6 6 6 1 1 1 1 1
symmnumber: 1
zpe: 334653.1 jmol-1
zpe.correction: 0.127463 hartree
zpe.thermalcorrener: 0.142728 hartree
zpe.thermalcorrenthalpy: 0.143672 hartree
zpe.thermalcorrgfe: 0.082506 hartree
zpe.sumelectzpe: -768.573141 hartree
zpe.sumelectthermal: -768.557875 hartree
zpe.sumelectthermalent: -768.556931 hartree
zpe.sumelectthermalfe: -768.618098 hartree
dipole: 2.8269 3.4775 -1.2026
dipole: 4.6402
quadrupole: -108.0179 -108.2202 -104.3560
quadrupole: 0.9715 0.2404 1.6985
quadrupole: -1.1532 -1.3555 2.5087 0.9715 0.2404 1.6985
hfenergy: -768.7006037 hartree
pointgroup: C01 [X(C9H5Br1N2O4)]
dipole: 1.1057092 1.3192198 -0.6081097 debye
dipolederiv: -0.0465521 -0.2028215 0.0301963 -0.1995388 -0.495439 0.0728359 0.0170621 0.0635787 0.0241815 -2.1794398 0.0081589 -0.5000037 0.1873222 -0.2776799 0.1433047 -0.4159004 0.1390308 -0.5736163 -0.461904 -0.0410378 0.0717227 -0.0903642 -0.8364758 0.1071883 0.0909575 0.097847 -0.2370772 -0.7601002 0.0580679 0.1500007 0.0945517 -0.4814436 0.0099558 0.1352331 0.0292054 -0.2495956 -0.579805 -0.0400533 0.1859055 0.126339 -0.2921782 0.1867113 -0.437493 0.1056037 -0.8853022 1.1151145 -0.3447637 -0.2572932 -0.2295819 1.5170135 -0.1443666 -0.2445306 -0.1555841 0.2781063 -0.3503355 -0.0041218 -0.0003207 -0.0071877 -0.1906422 -0.0034174 0.0075591 -0.0035623 -0.2195831 1.224976 -0.0177289 0.197635 -0.0401021 0.0359324 0.1038022 -0.2088031 -0.0105858 0.0578821 -0.2380325 0.4012067 0.0025975 0.0953189 -0.4268679 0.0228758 0.1019812 0.0049846 0.0648676 0.0157312 -0.2763695 -0.0071419 -0.0498711 -0.0359762 -0.0121764 -0.0205319 0.0357853 -0.0812006 -0.3270198 0.4903006 -0.1303393 0.5601367 1.0059543 -0.1672869 -0.0937223 -0.1541599 -0.1155179 0.0640779 0.0316701 -0.0074115 -0.0279564 -0.0098061 -0.0212749 -0.0030356 0.0118623 0.1281144 0.0761631 -0.117764 0.0330033 -0.0016874 -0.1246418 0.0370854 -0.0115396 0.0124269 -0.0527164 2.0744473 0.0044859 0.1946393 -0.4572683 0.3671248 -0.3848184 1.0111774 -0.2254344 1.4170086 -0.4068822 -0.0152657 0.1158482 0.0535145 -0.0004718 -0.0059689 0.2129274 0.0141314 -0.1085987 0.322972 0.0190633 -0.0097599 0.0238226 -0.0883665 0.0097923 -0.0218956 0.0110408 0.0210787 0.1305484 -0.0026576 -0.0050116 -0.0394406 0.1122281 0.0087064 0.0202556 0.0042909 0.175298 0.0795827 0.0441063 -0.0039335 0.039382 0.060136 0.0084754 0.0091926 0.0123869 0.1587756 0.127261 -0.020178 -0.002025 0.0048068 0.0410889 -0.0793576 -0.0259847 -0.0725634 0.0853663 0.0019082 -0.0040705 -0.0550028 -0.009846 0.1265415 0.023908 -0.0983586 0.0075258 0.0054779 0.1172888 0.0297727 -0.0033055 -0.0323499 -0.0060304 0.0840256 -0.0245505 0.0721895 0.107051 unknown
polarizability: 211.9151621|10.5598652|163.6469531|-5.8622355|-14.6578227|69.8096031 unknown
InChI: InChI=1S/C9H5BrN2O4/c1-5(13)16-9-7(10)2-6(4-11)3-8(9)12(14)15/h2-3H,1H3
charge 0 multiplicity 1
21 atoms
Br 0.329359 3.43512 -0.54953
O  1.833387 0.786966 -0.413663
O  0.119445 -3.091957 0.272055
O  1.93813 -1.945124 -0.465676
O  2.390261 -0.00095 1.733588
N  0.708642 -2.002755 -0.081707
N  -4.960476 -0.085894 0.193359
C  0.47356 0.540474 -0.254108
C  -0.104318 -0.753143 -0.081518
C  -1.497239 -0.921242 0.044693
C  -0.408934 1.653315 -0.323549
C  -2.351124 0.20182 -0.023622
C  -1.799951 1.498481 -0.218836
C  2.777894 0.371352 0.622379
C  4.168914 0.52146 0.085573
C  -3.776256 0.041404 0.095823
H  -1.8935 -1.929356 0.187127
H  -2.456991 2.370168 -0.274681
H  4.354888 -0.300582 -0.629243
H  4.897305 0.462992 0.906655
H  4.274902 1.471449 -0.46262
