program: Gaussian 09
title: 000183203
version: EM64L-G09RevD.01
frameworkgroup: C1[X(C24H20O)]
method: RPBEPBE
basis: SDD
operation: Freq
keyword: #pfreq=noraman
keyword: PBEPBE/SDD
title: #p freq=noraman PBEPBE/SDD
converged: YES YES NO NO
title: Mulliken charges:
elementType: O C C C C C C C C C C C C C C C C C C C C C C C C H H H H H H H H H H H H H H H H H H H H
charge: -0.187819 -0.316213 -0.442712 -0.406722 -0.393012 0.403174 -0.520144 0.154916 0.192109 0.246435 -0.405318 0.183401 -0.434798 0.485859 -0.416782 -0.293050 -0.547713 -0.604096 -0.721294 0.409200 0.406346 -0.433122 -0.428672 -0.245998 -0.243748 0.218402 0.222297 0.235154 0.222520 0.191736 0.211927 0.216366 0.244095 0.219418 0.260780 0.215178 0.225549 0.225875 0.236884 0.227259 0.247188 0.241623 0.241416 0.228102 0.228004
chargesum: 0.00000
title: Mulliken charges with hydrogens summed into heavy atoms:
elementType: O C C C C C C C C C C C C C C C C C C C C C C C C
charge: -0.187819 -0.097810 0.014739 0.007534 0.035281 0.403174 -0.056631 0.154916 0.192109 0.246435 -0.144538 0.183401 -0.219620 0.485859 -0.191233 -0.067175 -0.310830 -0.376838 -0.474105 0.409200 0.406346 -0.191499 -0.187256 -0.017896 -0.015744
polarizability: 4.95863608e+02 -1.50907540e+01 2.61391778e+02 -1.74256423e+00 1.11646014e+01 1.32233889e+02
1716.lowfreq: -9.8383 -0.0009 -0.0008 -0.0003 6.2837 8.3443 17.3816 31.4117 48.2540
frequency: 15.2506 30.5676 47.8139 66.1980 90.5860 93.2165 135.9393 144.6066 169.5041 187.7725 223.2611 243.3663 280.1886 293.2589 305.5466 311.9409 336.4018 388.9744 396.4029 413.5202 453.8987 466.4203 469.5099 486.1592 493.1779 512.5862 526.9324 541.4393 572.2380 575.5008 606.7110 620.8044 649.8093 671.0880 707.9330 714.2409 741.9442 751.3573 754.4481 766.1527 781.0176 783.8965 816.0262 825.5756 834.7540 838.0160 859.2949 862.5664 872.8864 884.4933 899.7047 904.0103 913.5353 932.2745 938.3469 964.2060 969.2728 975.8188 978.2235 988.8766 1017.0504 1023.6416 1029.1559 1063.6994 1076.9873 1092.4732 1098.2158 1119.5022 1131.1204 1165.1741 1172.1645 1191.6039 1194.7671 1199.5641 1222.1167 1224.7694 1240.5139 1249.6768 1253.6841 1265.5077 1275.4856 1286.9181 1295.3215 1301.0741 1309.5653 1326.7904 1336.6085 1340.1904 1348.3872 1385.2687 1395.9391 1411.8511 1423.0388 1433.2298 1444.8114 1446.3636 1459.2278 1463.4824 1465.2905 1475.8298 1484.5491 1504.1895 1558.9726 1572.0954 1594.8944 1606.2913 1626.5126 1632.4776 1637.7481 2967.5649 2969.6773 2977.8730 2982.9934 2987.4868 3035.0492 3043.9408 3052.2645 3074.5947 3115.5083 3118.4954 3120.4109 3123.5618 3132.6339 3140.0012 3141.9383 3151.0158 3160.4539 3161.3622 3178.3876
redmass: 4.2735 4.9929 3.5599 4.6051 5.9696 4.4267 3.9066 3.5017 4.2068 4.0344 4.9874 3.7988 4.2065 1.7917 4.9647 5.2889 4.0063 4.9182 3.2382 3.0648 2.5296 4.4863 2.4817 4.2341 3.8538 3.8925 3.7821 6.1325 5.8368 3.0535 4.4568 6.6390 3.1526 5.0273 2.6164 4.4771 2.6596 4.2492 1.3227 1.5698 2.2834 4.7461 1.5236 2.0622 2.4240 2.8237 1.7700 2.3602 3.4255 1.5302 1.5654 2.5528 1.9916 2.1073 2.7533 1.4017 2.7484 1.4616 1.3741 1.3561 2.3093 2.1999 2.3039 2.2155 1.2634 2.1104 2.0974 2.4889 1.7717 1.5153 1.1235 1.2745 1.3330 1.4840 1.6047 1.5067 1.5982 1.7306 1.5275 1.3301 2.0608 1.8834 1.6664 1.3365 1.8536 2.0210 1.4640 1.5802 1.8029 3.4913 2.9443 3.3294 2.2887 4.2586 3.4786 1.1007 2.7802 1.0871 1.0958 1.0915 2.8282 4.0999 5.6018 7.4477 5.5244 5.8158 7.1044 9.2971 6.8029 1.0645 1.0696 1.0716 1.0611 1.0652 1.0958 1.1020 1.1033 1.0972 1.0909 1.0859 1.0870 1.0888 1.0875 1.0900 1.0946 1.0953 1.0929 1.0995 1.0959
irintensity: 1.0506 0.6162 1.0956 0.1849 1.4724 0.7232 2.0657 0.6407 0.0617 1.1945 5.9089 0.3885 0.5510 0.1897 3.2825 0.8993 3.8921 1.2613 1.3438 0.1093 2.1508 0.9562 18.1551 3.9989 0.6333 12.7803 7.7473 10.6985 4.8896 3.0798 1.9198 2.2103 3.3934 3.7556 1.4333 0.8254 6.8979 3.0223 60.2747 37.5813 5.3895 1.3462 18.8194 11.9966 9.3688 1.0722 0.9365 0.4066 2.7194 7.1503 65.8608 0.6068 2.8783 1.1535 6.9125 6.3608 6.9801 7.5430 1.3145 0.1701 4.4981 9.7335 5.3392 13.2275 1.7981 11.0942 1.5191 72.3909 8.2000 1.9144 0.7074 0.4407 6.0858 10.9889 11.5552 4.2813 13.3690 8.0103 0.9839 2.2119 2.9537 4.2130 8.7457 9.3684 11.7202 1.7346 0.0837 5.7673 17.8981 5.4799 3.0125 7.5045 0.2173 0.7139 2.7933 13.9105 12.1166 11.4703 14.0542 7.4479 8.7990 9.4307 11.2573 2.7072 1.9755 5.1325 8.1556 120.0643 0.3559 27.3544 5.7949 9.3733 43.5882 40.3288 53.1386 37.5556 44.6090 28.4959 5.7107 4.6439 7.4221 1.8074 8.1990 1.5157 30.1942 40.5296 16.6193 56.6649 13.3612
temp: 298.150 k
press: 1.00000 atm
elementType: 8 6 6 6 6 6 6 6 6 6 6 6 6 6 6 6 6 6 6 6 6 6 6 6 6 1 1 1 1 1 1 1 1 1 1 1 1 1 1 1 1 1 1 1 1
symmnumber: 1
zpe: 960532.4 jmol-1
zpe.correction: 0.365847 hartree
zpe.thermalcorrener: 0.385252 hartree
zpe.thermalcorrenthalpy: 0.386196 hartree
zpe.thermalcorrgfe: 0.316897 hartree
zpe.sumelectzpe: -1000.098590 hartree
zpe.sumelectthermal: -1000.079185 hartree
zpe.sumelectthermalent: -1000.078241 hartree
zpe.sumelectthermalfe: -1000.147540 hartree
dipole: -0.7816 -2.7174 1.8460
dipole: 3.3768
quadrupole: -123.0786 -132.8509 -155.3431
quadrupole: 13.2386 -8.0250 7.8285
quadrupole: 14.0123 4.2399 -18.2522 13.2386 -8.0250 7.8285
hfenergy: -1000.4644375 hartree
pointgroup: C01 [X(C24H20O1)]
dipole: -0.3222194 0.9230177 -0.8995793 debye
polarizability: 495.706808|15.3837797|261.2838897|-6.2292067|-12.2821327|132.4985782 unknown
InChI: InChI=1S/C24H20O/c25-24-11-4-3-8-22(24)19-9-5-10-20-21(19)13-12-18-14-16-6-1-2-7-17(16)15-23(18)20/h1-2,5-7,9-10,12-15,22H,3-4,8,11H2
charge 0 multiplicity 1
45 atoms
O  -4.669865 -1.183962 1.788804
C  -3.537672 0.24198 0.09623
C  -4.087218 0.402697 -1.368974
C  -5.299422 1.356103 -1.438706
C  -6.43619 0.884093 -0.506052
C  -2.286978 -0.630112 0.119104
C  -5.926485 0.726366 0.954344
C  -4.698264 -0.185094 1.024578
C  -0.968463 -0.047466 0.055159
C  0.198319 -0.901461 0.035549
C  -2.417271 -2.032065 0.12486
C  1.547617 -0.306562 -0.012046
C  -0.768442 1.392184 -0.012871
C  1.682795 1.141607 -0.070691
C  0.010294 -2.313012 0.057206
C  -1.275006 -2.869247 0.093714
C  0.487201 1.956213 -0.07565
C  2.729507 -1.077988 -0.001505
C  2.962333 1.735642 -0.120447
C  4.02434 -0.490584 -0.04852
C  4.148584 0.957091 -0.111821
C  5.222233 -1.287536 -0.034617
C  5.461422 1.543584 -0.160043
C  6.47981 -0.688725 -0.081993
C  6.60081 0.741619 -0.14584
H  -3.292425 1.266863 0.442928
H  -4.368251 -0.598152 -1.752402
H  -3.263262 0.768236 -2.009967
H  -5.663543 1.4223 -2.481781
H  -4.982701 2.378314 -1.144451
H  -6.828146 -0.089396 -0.86213
H  -7.281269 1.597615 -0.525683
H  -6.706445 0.311539 1.615503
H  -5.645808 1.727454 1.342966
H  -3.41067 -2.48282 0.181363
H  -1.638528 2.055454 -0.022381
H  0.873312 -2.984531 0.038611
H  -1.399695 -3.95738 0.10649
H  0.602167 3.045474 -0.128742
H  2.675982 -2.170485 0.048306
H  3.039781 2.829518 -0.164311
H  5.13001 -2.379277 0.014225
H  5.551288 2.635558 -0.207401
H  7.385056 -1.305667 -0.07058
H  7.596751 1.196616 -0.182536
