program: Gaussian 09
title: 000183180
version: EM64L-G09RevD.01
frameworkgroup: C1[X(C20H20O)]
method: RPBEPBE
basis: SDD
operation: Freq
keyword: #pfreq=noraman
keyword: PBEPBE/SDD
title: #p freq=noraman PBEPBE/SDD
converged: YES YES NO NO
title: Mulliken charges:
elementType: O C C C C C C C C C C C C C C C C C C C C H H H H H H H H H H H H H H H H H H H H
charge: -0.448743 -0.209281 -0.086705 -0.444646 -0.431718 -0.410716 -0.396108 0.391245 0.137930 -0.748140 0.226899 0.452544 0.155045 -0.386906 -0.399990 -0.477522 -0.355483 -0.276541 -0.264944 -0.250887 -0.259338 0.203102 0.187832 0.221340 0.185183 0.223057 0.207693 0.197077 0.203061 0.195222 0.205876 0.231327 0.350338 0.258406 0.226265 0.246916 0.223006 0.230261 0.229786 0.230022 0.228236
chargesum: 0.00000
title: Mulliken charges with hydrogens summed into heavy atoms:
elementType: O C C C C C C C C C C C C C C C C C C C C
charge: -0.098405 -0.006179 0.101127 -0.038123 -0.000968 -0.010578 0.004990 0.391245 0.137930 -0.516813 0.226899 0.452544 0.155045 -0.128499 -0.173725 -0.230606 -0.132478 -0.046280 -0.035158 -0.020864 -0.031102
polarizability: 2.90340403e+02 2.10271122e+01 2.73125689e+02 -9.71103144e+00 -7.64027930e+00 1.18447779e+02
1716.lowfreq: -11.3820 -0.0004 -0.0003 -0.0001 8.2399 10.1736 37.8405 45.1941 70.9267
frequency: 37.5310 44.9811 70.9066 98.0031 103.9924 144.0540 170.2332 193.1395 215.4057 240.1265 267.0782 301.3827 324.5623 360.8102 366.2484 384.4903 403.7099 414.3901 430.4501 443.2160 459.1311 466.6235 513.2261 525.0730 550.9475 571.1084 581.3134 614.3489 639.1865 681.1934 704.5609 737.3131 759.5204 769.0347 778.4938 792.9161 807.2615 844.0247 856.4928 867.2683 880.1906 884.7681 887.9090 922.4669 930.3574 947.5454 956.6631 963.0242 988.1329 990.6960 992.2560 1004.8352 1031.8898 1040.1902 1048.1740 1052.6254 1055.8626 1095.1162 1104.8530 1108.6304 1121.4310 1154.6519 1177.4174 1185.6642 1189.8842 1215.6408 1222.0111 1231.5807 1252.2420 1259.0668 1262.8758 1274.2364 1283.8360 1310.4192 1316.3728 1320.6296 1328.4261 1339.1007 1342.9037 1350.4363 1374.8052 1379.6758 1397.1057 1409.4389 1436.2879 1445.4576 1450.3570 1462.5545 1466.0347 1472.5575 1479.1113 1494.7291 1533.3753 1578.8302 1606.4426 1617.9535 1626.4837 2916.5099 2971.3785 2972.4602 2973.8122 2988.1476 3002.2946 3032.5923 3037.1286 3046.3504 3057.7920 3121.6395 3129.9663 3131.5915 3133.8385 3145.1862 3151.7249 3162.4115 3167.7895 3178.5501 3544.6019
redmass: 4.2226 4.2522 3.7591 3.9896 4.0502 3.5125 4.2535 3.3548 3.3158 3.9607 4.8290 4.5433 1.7004 2.4884 1.2175 2.8661 6.1870 3.9949 2.9843 3.7616 3.3642 4.3456 2.9473 3.2612 2.8789 3.4256 4.9888 6.8109 3.3992 4.1829 5.4650 2.4942 1.4223 1.7201 1.9458 3.3441 1.8283 1.9938 1.7946 1.6649 2.5597 1.8207 1.9263 1.9331 2.2591 2.3002 1.4385 1.4164 1.4342 2.2453 2.1054 4.0303 2.0689 1.9757 2.6455 1.7981 1.7655 1.4022 2.3551 2.3542 2.2104 1.4478 1.0742 1.1150 1.4927 1.3409 1.4050 1.3407 2.5343 1.4842 1.4032 1.4363 1.4627 1.6774 1.5076 1.4279 1.3461 1.4255 1.4162 1.4464 2.0419 2.5243 3.3631 3.4360 2.3475 2.6846 3.0600 1.0898 1.0907 1.0837 1.0952 2.9590 3.7529 7.5461 5.7867 6.1623 6.4828 1.0827 1.0618 1.0643 1.0623 1.0626 1.0817 1.0962 1.0988 1.1016 1.1021 1.0864 1.0860 1.0894 1.0883 1.0916 1.0930 1.0982 1.0964 1.0958 1.0656
irintensity: 0.5405 0.0843 0.4376 0.2465 1.3197 0.6612 1.9067 0.6884 0.2706 0.3674 0.0915 1.8548 0.3288 12.3750 171.5198 16.2044 0.9154 2.1371 3.3173 0.8350 0.2509 1.2925 5.0107 3.3042 6.0686 0.1894 0.8977 4.3343 0.5354 1.0562 0.6799 40.4124 71.2316 21.2777 23.4791 1.2916 2.3318 8.9472 18.7268 0.9741 2.7597 1.1027 3.3812 9.9007 10.6081 9.3248 1.9315 4.5025 1.3297 0.9112 1.2312 51.4287 4.0153 6.0406 7.9646 1.6348 3.8950 15.3633 0.1794 5.8547 7.4043 3.8058 0.6994 0.7363 0.5554 13.0750 3.5096 6.3826 5.4507 6.7526 6.3829 0.7453 1.4886 4.1806 2.1013 2.1404 20.5958 1.7817 1.4592 2.7039 4.3557 8.8094 10.0083 5.3696 8.3349 5.9286 6.9234 10.7641 6.1597 18.7882 5.2418 15.5378 1.9518 0.6447 8.5982 0.1758 7.2654 26.7191 36.5112 38.3555 17.8513 16.9995 25.8831 62.6728 53.5453 40.8294 62.8329 2.3284 1.2174 6.9265 16.1012 26.0324 3.9243 30.1475 52.4067 14.4588 2.8356
temp: 298.150 k
press: 1.00000 atm
elementType: 8 6 6 6 6 6 6 6 6 6 6 6 6 6 6 6 6 6 6 6 6 1 1 1 1 1 1 1 1 1 1 1 1 1 1 1 1 1 1 1 1
symmnumber: 1
zpe: 901121.4 jmol-1
zpe.correction: 0.343219 hartree
zpe.thermalcorrener: 0.360175 hartree
zpe.thermalcorrenthalpy: 0.361119 hartree
zpe.thermalcorrgfe: 0.298840 hartree
zpe.sumelectzpe: -847.890529 hartree
zpe.sumelectthermal: -847.873573 hartree
zpe.sumelectthermalent: -847.872629 hartree
zpe.sumelectthermalfe: -847.934908 hartree
dipole: -0.5454 -1.1446 -1.0169
dipole: 1.6253
quadrupole: -112.1538 -112.8422 -133.0316
quadrupole: -4.8185 -6.4388 -3.8388
quadrupole: 7.1888 6.5003 -13.6891 -4.8185 -6.4388 -3.8388
hfenergy: -848.2337477 hartree
pointgroup: C01 [X(C20H20O1)]
dipole: 0.2155993 0.3748559 -0.4710379 debye
polarizability: 290.0995747|22.5681694|271.2504022|6.8805647|-19.1203727|120.5638935 unknown
InChI: InChI=1S/C20H20O/c21-20-12-6-5-11-18(20)19-13-14-7-1-2-8-15(14)16-9-3-4-10-17(16)19/h1-4,7-10,13,18,20-21H,5-6,11-12H2
charge 0 multiplicity 1
41 atoms
O  -2.345259 -0.713008 1.994085
C  -2.078663 0.043015 -0.402444
C  -2.763677 0.273248 0.98575
C  -2.670122 1.053984 -1.426013
C  -4.292328 0.146029 0.890947
C  -4.204534 0.901832 -1.54168
C  -4.884568 1.104504 -0.16722
C  -0.551045 0.096683 -0.289363
C  0.245206 -1.11687 -0.071872
C  0.107072 1.3177 -0.351729
C  1.687975 -1.028959 0.031278
C  1.537555 1.448968 -0.234492
C  2.35018 0.275352 -0.049642
C  -0.368404 -2.407587 0.046905
C  2.433952 -2.2328 0.224142
C  2.155362 2.736714 -0.30679
C  3.765646 0.447149 0.05182
C  0.391083 -3.567822 0.237682
C  1.807478 -3.480792 0.322347
C  3.543436 2.875898 -0.201861
C  4.35342 1.717541 -0.021922
H  -2.388036 -0.964092 -0.742924
H  -2.490833 1.300179 1.32502
H  -2.183548 0.905977 -2.408719
H  -2.446872 2.09371 -1.111745
H  -4.72688 0.337668 1.889284
H  -4.532202 -0.90388 0.629539
H  -4.448264 -0.109529 -1.927178
H  -4.599598 1.629763 -2.276316
H  -4.740948 2.155318 0.159027
H  -5.97636 0.943747 -0.248745
H  -0.465685 2.238884 -0.507384
H  -1.35719 -0.695413 2.078183
H  -1.456357 -2.493643 0.004508
H  3.52417 -2.188276 0.300761
H  1.520001 3.619272 -0.447814
H  4.416032 -0.421358 0.191434
H  -0.106553 -4.539375 0.328198
H  2.406568 -4.385899 0.469922
H  4.008013 3.866208 -0.258141
H  5.441076 1.820564 0.059466
