program: Gaussian 09
title: 000183153
version: EM64L-G09RevD.01
frameworkgroup: C1[X(C8H11N3O)]
method: RPBEPBE
basis: SDD
operation: Freq
keyword: #p
keyword: freq=noraman
keyword: PBEPBE/SDD
title: #p freq=noraman PBEPBE/SDD
converged: YES YES NO YES
title: Mulliken charges:
elementType: O N N N C C C C C C C C H H H H H H H H H H H
charge: -0.260435 -0.027525 -0.043082 -0.617504 -0.189007 0.319567 -0.693652 -0.693636 -0.485290 0.110756 -0.379723 0.166711 0.207631 0.243781 0.218354 0.217004 0.217010 0.218364 0.243762 0.253744 0.284549 0.353868 0.334753
chargesum: 0.00000
title: Mulliken charges with hydrogens summed into heavy atoms:
elementType: O N N N C C C C C C C C
charge: -0.260435 -0.027525 -0.043082 0.071117 0.018624 0.319567 -0.014513 -0.014500 -0.231547 0.110756 -0.095173 0.166711
polarizability: 1.59090726e+02 2.34415937e+00 1.06735934e+02 1.69256424e-03 -3.89938907e-03 6.51243970e+01
1716.lowfreq: -5.8000 -1.4283 -0.0008 -0.0004 -0.0001 7.3559 40.2317 64.2637 93.5625
frequency: 40.2163 64.2518 93.5553 139.9978 181.9099 211.2773 220.8704 252.9322 277.5996 328.0245 367.3754 409.2074 446.2391 514.6720 536.5543 577.6012 602.8585 628.8586 679.4369 682.9987 717.4550 809.7415 816.9649 888.0819 919.1481 931.7035 960.6029 970.1464 988.7205 1058.1948 1067.3604 1106.3071 1139.7228 1163.7670 1225.1236 1248.0109 1259.6651 1291.9872 1298.9211 1348.1903 1372.1809 1376.5627 1390.3023 1458.6759 1463.0785 1472.0784 1478.0343 1491.4859 1496.1016 1538.9671 1559.4201 1636.3037 2981.6685 2982.6313 2991.4145 3076.4282 3080.5047 3091.1250 3097.1494 3138.0197 3168.8843 3489.3616 3665.7245
redmass: 3.4421 4.3197 5.8754 3.9499 2.9209 1.1221 2.0640 1.4140 3.4967 3.5964 3.1986 4.7031 3.0739 5.8298 2.7331 3.2642 1.4728 9.0838 3.1770 1.0965 4.7567 5.6869 5.1639 2.6734 1.2244 1.4365 1.5153 1.4049 3.8273 1.7389 1.8867 2.6025 2.9291 2.1901 1.9426 6.4555 3.6234 1.5269 1.3273 2.3361 1.1867 2.1192 1.2124 2.4312 1.0438 1.0499 1.0484 1.5571 2.7644 5.3175 1.3532 5.4800 1.0346 1.0394 1.0797 1.1007 1.0997 1.1010 1.1001 1.0925 1.0934 1.0464 1.1027
irintensity: 2.2943 0.6947 3.6530 7.1751 0.0006 0.0552 4.4572 0.9324 4.0204 3.3777 0.3652 10.5779 5.3402 4.4158 43.4404 10.6999 115.0504 0.3338 2.5721 130.2495 30.9680 1.0957 0.8884 2.4384 0.0078 18.2445 0.0000 3.3858 20.0809 34.2631 1.8243 0.1000 0.6217 13.0281 36.6866 3.1047 55.3872 0.0594 0.0963 94.6553 16.0099 61.0931 11.2307 9.1895 5.1790 2.5282 17.8064 10.3996 17.0237 45.9264 166.0945 277.7044 36.2752 25.0608 24.6794 21.0713 54.1695 2.9706 41.9538 20.1508 0.9721 45.1828 74.1511
temp: 298.150 k
press: 1.00000 atm
elementType: 8 7 7 7 6 6 6 6 6 6 6 6 1 1 1 1 1 1 1 1 1 1 1
symmnumber: 1
zpe: 484262.4 jmol-1
zpe.correction: 0.184446 hartree
zpe.thermalcorrener: 0.196162 hartree
zpe.thermalcorrenthalpy: 0.197106 hartree
zpe.thermalcorrgfe: 0.146311 hartree
zpe.sumelectzpe: -550.047955 hartree
zpe.sumelectthermal: -550.036239 hartree
zpe.sumelectthermalent: -550.035295 hartree
zpe.sumelectthermalfe: -550.086089 hartree
dipole: 2.1589 3.8512 -0.0027
dipole: 4.4151
quadrupole: -67.3930 -72.6209 -72.2303
quadrupole: -8.7932 0.0109 -0.0019
quadrupole: 3.3551 -1.8728 -1.4823 -8.7932 0.0109 -0.0019
hfenergy: -550.2324008 hartree
pointgroup: C01 [X(C8H11N3O1)]
dipole: -0.8584268 -1.5100939 0.0032663 debye
dipolederiv: -0.8064019 -0.2596551 0.0006737 -0.0743628 -0.8806852 0.0011006 0.0003699 0.0012223 -0.3619238 -0.3973269 0.0129015 -0.0000052 -0.1707675 -0.1839567 -0.000205 0.0004573 -0.0002344 -0.2723869 -0.1801621 0.0702541 -0.0002113 0.1581923 -0.2244133 -0.0000517 -0.000274 -0.0000137 -0.2288331 -0.7792381 0.4353501 -0.0008447 0.3465092 -0.8940094 0.0004926 -0.0006431 0.0005259 -0.6711217 -0.0968171 0.0276313 -0.0000097 0.2275564 0.1721985 -0.0003995 -0.0003373 -0.0003615 0.0317192 0.8556803 0.0793488 -0.0004229 -0.2321517 -0.1247995 0.0005585 0.0004628 0.0004896 0.0489293 -0.0413829 0.0168174 -0.0425472 -0.0718089 0.0308373 0.0254921 0.0879462 0.0444265 0.0004936 -0.0414377 0.0170274 0.0424724 -0.0722597 0.0305384 -0.0256026 -0.0876893 -0.0445747 0.0008829 -0.4139472 -0.0741942 0.0003146 0.3993241 0.2751564 -0.0009222 -0.0010565 -0.0008123 -0.008174 -0.1223571 0.1286638 -0.0003417 -0.3043309 -0.143239 0.0007574 0.0007989 0.0006564 0.1168719 -0.0500006 -0.0852562 0.000261 0.2389817 0.2636433 -0.0007285 -0.0006742 -0.0006478 0.0316469 1.3952286 -0.1376878 0.000026 -0.181805 1.3690083 -0.0024593 -0.0000437 -0.0025936 0.2020214 0.0323061 0.0151195 -0.0000475 -0.0462685 -0.17796 0.0005266 0.0000952 0.0005314 0.0292842 0.1155957 -0.0660845 0.0020079 -0.0270488 -0.0880279 0.0333017 0.0038097 -0.0232542 0.0827684 -0.2227028 -0.013043 -0.0303072 0.0009345 0.0966119 0.0188805 -0.024629 0.0151305 0.0741314 0.0841531 0.0549051 0.0855999 0.0339011 0.0341168 -0.0981945 0.0482931 -0.0632867 -0.1191839 0.0840886 0.0545053 -0.085969 0.0336972 0.0349321 0.0974034 -0.0485905 0.0624659 -0.1199159 -0.2226882 -0.0129266 0.0305068 0.0010478 0.0964306 -0.0190021 0.0248017 -0.0152479 0.0742708 0.1155321 -0.0660741 -0.0016556 -0.0270698 -0.0881149 -0.0324425 -0.0036634 0.0241497 0.0828041 0.0324599 -0.0757584 0.0002282 -0.1016541 -0.0438564 0.0004896 0.0002773 0.0004787 0.1194404 0.1014249 -0.0434535 0.0001339 -0.0650396 0.0313766 0.000303 0.0002207 0.0002988 0.1291507 0.362478 -0.0358781 0.0000075 -0.0481845 0.2206127 0.0003001 -0.0000255 0.0002444 0.3686385 0.1955154 -0.0425127 0.0001297 -0.0173926 0.1935992 0.000402 0.0000937 0.0004068 0.3884855 unknown
polarizability: 159.1168592|2.0311659|106.7095034|-0.0275448|-0.1102828|65.1246943 unknown
InChI: InChI=1S/C8H11N3O/c1-5(2)6-3-11-7(4-10-6)8(9)12/h3-5H,9H2,1-2H3
charge 0 multiplicity 1
23 atoms
O  3.419378 1.336164 -0.004043
N  -0.835611 1.022059 -0.003033
N  0.869325 -1.255783 0.003234
N  3.563633 -1.004235 0.00112
C  -2.867711 -0.390699 0.001274
C  -1.353882 -0.250675 0.000652
C  -3.468712 0.249875 -1.278503
C  -3.468194 0.256226 1.278119
C  -0.485929 -1.3777 0.003796
C  1.375772 0.017223 -0.000601
C  0.521025 1.146769 -0.003627
C  2.87747 0.187898 -0.001321
H  -3.1096 -1.472356 0.004024
H  -3.205841 1.321175 -1.320791
H  -4.569691 0.155388 -1.271554
H  -3.08667 -0.236557 -2.194631
H  -3.085686 -0.225554 2.196509
H  -4.569167 0.161576 1.272143
H  -3.205458 1.327769 1.314905
H  -0.889833 -2.395727 0.006773
H  0.945749 2.154189 -0.006597
H  3.027735 -1.875286 0.00284
H  4.581698 -0.999741 0.000917
