program: Gaussian 09
title: 000183191
version: EM64L-G09RevD.01
frameworkgroup: C1[X(C26H19ClO)]
method: RPBEPBE
basis: SDD
operation: Freq
keyword: #p
keyword: freq=noraman
keyword: PBEPBE/SDD
title: #p freq=noraman PBEPBE/SDD
converged: YES YES NO NO
title: Mulliken charges:
elementType: Cl O C C C C C C C C C C C C C C C C C C C C C C C C C C H H H H H H H H H H H H H H H H H H H
charge: -0.027278 -0.181436 -0.333376 -0.439625 0.421437 -0.408367 -0.395521 0.274255 0.164087 -0.517856 0.005049 -0.027415 0.491344 0.332911 -0.421590 0.751455 -0.507437 -0.536671 -0.492729 0.168662 -0.478770 -0.527023 0.678107 -1.049204 -0.355822 -0.477470 -0.271300 -0.245815 0.223956 0.233740 0.221389 0.194170 0.223741 0.218186 0.213160 0.218807 0.245380 0.249918 0.217466 0.242237 0.224806 0.243507 0.270084 0.228634 0.274127 0.230444 0.233648
chargesum: 0.00000
title: Mulliken charges with hydrogens summed into heavy atoms:
elementType: Cl O C C C C C C C C C C C C C C C C C C C C C C C C C C
charge: -0.027278 -0.181436 -0.109420 0.015504 0.421437 0.009543 0.035825 0.274255 0.164087 -0.053670 0.005049 -0.027415 0.491344 0.332911 -0.171673 0.751455 -0.289971 -0.294434 -0.267924 0.168662 -0.235263 -0.256939 0.678107 -1.049204 -0.127188 -0.203342 -0.040856 -0.012167
polarizability: 5.36684552e+02 -4.64857334e+01 3.42048899e+02 5.04812215e+00 -3.77003651e+00 1.42112168e+02
1716.lowfreq: -8.7837 -1.6004 -0.0006 -0.0004 0.0007 8.0892 15.4104 33.1108 50.5643
frequency: 14.7139 33.0155 50.5566 56.6402 74.5130 88.7150 113.7047 150.6032 157.5715 170.3350 177.4598 218.7251 231.9018 233.8097 277.6046 296.2188 305.1112 315.2962 339.1620 349.6558 374.8012 408.1537 419.5444 435.0995 448.2404 469.1493 481.0448 496.8594 516.2306 520.4258 535.2153 556.3006 563.8280 569.8632 613.2586 630.5389 635.1102 648.1619 655.3372 698.6330 708.0664 725.6128 738.7370 766.6285 771.7453 782.4092 793.5266 815.6929 832.0189 838.8684 854.9877 859.7051 862.9953 870.8750 877.4167 887.5895 902.4189 933.9151 959.3797 962.2285 966.6768 967.6089 987.8274 993.1331 1004.8182 1018.9734 1024.3286 1038.2445 1055.0511 1066.9244 1079.2054 1097.4279 1116.4710 1119.5307 1139.3833 1167.2051 1181.6249 1191.4502 1198.6734 1204.6994 1222.1020 1248.2207 1250.0504 1254.6178 1260.0491 1266.2918 1283.0114 1297.2784 1301.1892 1319.7421 1322.7675 1336.2835 1340.4114 1345.7276 1366.2443 1385.9949 1392.9395 1403.7594 1417.5253 1428.6976 1438.1883 1448.1429 1460.0103 1464.5829 1464.9564 1477.5563 1478.1005 1510.7784 1519.0356 1555.0343 1573.2912 1592.8545 1610.3858 1617.6249 1632.0869 1632.9730 2970.8898 2973.8606 2983.0129 2984.6145 2992.7993 3035.8102 3045.4886 3054.0419 3077.0482 3130.1662 3132.3920 3132.8477 3138.8186 3148.9727 3161.7218 3167.1590 3170.1346 3173.6673 3176.0416
redmass: 4.4905 6.4971 3.9895 4.6612 5.6438 6.0974 4.3310 2.8433 4.4975 4.6772 7.9430 4.5428 5.6462 6.5407 4.9609 1.8195 5.4972 5.0403 7.1822 6.6691 4.3120 3.3116 5.0822 3.4133 3.1977 3.5298 4.4622 2.9988 3.7712 6.6956 6.1809 3.5668 5.1368 3.7174 6.4616 4.2137 6.1145 7.3378 3.0793 3.2414 6.3429 2.8815 2.4734 4.1261 1.5268 1.9265 4.4687 1.6828 1.6427 2.0913 3.1319 2.4959 2.9102 2.0269 2.1272 1.6431 6.2552 2.8320 1.4476 1.4703 1.6151 2.2030 1.5597 1.3508 3.0221 2.0055 4.7833 2.3335 2.3240 1.6254 1.5890 2.0149 2.7738 2.7064 1.8510 1.3724 1.1148 1.6244 1.4498 1.4013 1.4417 1.3741 1.6900 1.5040 1.8624 1.6506 2.0417 1.4637 1.4890 3.6005 1.8665 1.4237 1.7920 1.5672 2.8935 2.9944 3.7778 3.6472 4.2117 4.7952 2.7802 1.0947 2.9063 1.0875 1.0873 2.1044 1.4576 5.2207 3.5330 6.4393 6.9917 7.1081 6.8818 6.2163 8.9310 7.4458 1.0635 1.0666 1.0658 1.0612 1.0742 1.0962 1.1021 1.1034 1.0976 1.0895 1.0855 1.0887 1.0859 1.0898 1.0963 1.0947 1.0931 1.0953 1.0978
irintensity: 0.9269 0.4613 0.9471 0.2346 1.3676 0.7691 0.0182 1.3145 2.9280 1.6634 0.0482 5.6989 3.3073 2.9514 1.0233 0.2155 0.7853 1.6191 1.7824 6.3127 0.1961 0.3583 0.8325 4.5316 4.9164 1.5802 1.0857 8.6640 2.5426 1.1711 1.7470 2.4229 4.0924 1.9122 0.4900 6.3673 3.1358 9.4778 4.7669 0.5182 5.5236 7.7318 8.8349 6.2790 109.4233 2.2401 15.8223 1.2455 9.4067 5.8111 16.0301 23.2032 2.9986 37.7573 12.9871 6.9691 38.8654 1.5620 0.7016 6.1255 4.9570 15.9376 6.2715 0.0011 12.9195 13.1284 4.5717 10.7674 4.0584 9.0640 4.8923 3.0337 31.5775 58.7969 1.7025 0.1389 0.9701 3.1348 18.7799 7.4935 3.9712 4.0047 8.1162 17.9816 13.6441 6.7041 28.9456 11.5367 7.1384 30.7068 2.4052 1.7036 7.2190 7.0256 0.3826 6.4539 16.7373 12.9765 3.6732 1.7740 6.1636 14.4855 38.6528 12.0721 13.6765 2.1640 5.1043 4.1849 11.2076 7.4659 2.6320 0.4728 5.0840 4.6172 96.0579 31.5362 30.2454 7.5299 9.8854 38.0008 39.8068 54.4030 34.4489 41.9401 28.5099 1.3758 3.8604 19.6363 13.9005 10.4811 3.7247 22.4453 33.6324 21.0013 21.8267
temp: 298.150 k
press: 1.00000 atm
elementType: 17 8 6 6 6 6 6 6 6 6 6 6 6 6 6 6 6 6 6 6 6 6 6 6 6 6 6 6 1 1 1 1 1 1 1 1 1 1 1 1 1 1 1 1 1 1 1
symmnumber: 1
zpe: 970549.3 jmol-1
zpe.correction: 0.369663 hartree
zpe.thermalcorrener: 0.391061 hartree
zpe.thermalcorrenthalpy: 0.392005 hartree
zpe.thermalcorrgfe: 0.318370 hartree
zpe.sumelectzpe: -1535.610877 hartree
zpe.sumelectthermal: -1535.589479 hartree
zpe.sumelectthermalent: -1535.588535 hartree
zpe.sumelectthermalfe: -1535.662170 hartree
dipole: -2.9370 -3.5623 -2.2092
dipole: 5.1182
quadrupole: -150.4951 -150.3446 -180.0171
quadrupole: 4.2147 11.3768 -5.0938
quadrupole: 9.7905 9.9410 -19.7315 4.2147 11.3768 -5.0938
hfenergy: -1535.9805402 hartree
pointgroup: C01 [X(C26H19Cl1O1)]
dipole: -1.0868922 -1.4099997 -0.9409693 debye
polarizability: 541.2368002|-35.6310884|337.259583|-1.2540881|8.305631|142.3492367 unknown
InChI: InChI=1S/C26H19ClO/c27-26-21-7-2-1-5-16(21)20-14-13-19-17(18-6-3-4-8-23(18)28)11-9-15-10-12-22(26)25(20)24(15)19/h1-2,5,7,9-14,18H,3-4,6,8H2
charge 0 multiplicity 1
47 atoms
Cl 5.077333 2.341847 -0.024798
O  -4.730172 0.669953 1.874549
C  -3.653702 -0.536659 -0.008552
C  -4.332475 -0.588779 -1.427787
C  -2.482992 0.434287 0.018054
C  -5.481967 -1.618724 -1.484886
C  -6.549582 -1.333151 -0.406274
C  -1.114865 -0.012997 -0.001441
C  -4.75276 -0.280601 1.0515
C  -5.909546 -1.280411 1.010957
C  -0.039483 0.957177 -0.008592
C  1.340899 0.529356 -0.022255
C  -0.353518 2.364231 0.001226
C  1.66886 -0.865501 -0.038166
C  -2.748097 1.821828 0.016526
C  2.402134 1.533165 -0.0194
C  -0.742296 -1.406381 -0.024829
C  -1.708512 2.771419 0.008436
C  0.582844 -1.809719 -0.042062
C  3.058009 -1.28923 -0.050219
C  0.722859 3.330876 0.002885
C  2.042425 2.936997 -0.0054
C  4.114437 -0.292843 -0.045332
C  3.735546 1.086238 -0.030289
C  3.442212 -2.669699 -0.066202
C  5.484836 -0.719563 -0.05571
C  4.783134 -3.060302 -0.076649
C  5.81524 -2.07383 -0.071102
H  -3.306227 -1.568589 0.197138
H  -3.553776 -0.827633 -2.175932
H  -4.715233 0.420585 -1.676831
H  -5.071399 -2.638832 -1.335865
H  -5.943867 -1.605264 -2.490591
H  -7.339648 -2.106926 -0.424189
H  -7.042883 -0.363724 -0.618134
H  -5.519595 -2.288261 1.262849
H  -6.647764 -0.995857 1.779907
H  -3.784933 2.167392 0.047657
H  -1.518601 -2.177114 -0.030168
H  -1.944662 3.841647 0.01825
H  0.798578 -2.881172 -0.058392
H  0.463883 4.395846 0.013864
H  2.845124 3.678462 -0.001254
H  2.67213 -3.44577 -0.06961
H  6.271076 0.039673 -0.051023
H  5.044234 -4.123964 -0.088614
H  6.86606 -2.382282 -0.078653
