program: Gaussian 09
title: 000183188
version: EM64L-G09RevD.01
frameworkgroup: C1[X(C26H26O)]
method: RPBEPBE
basis: SDD
operation: Freq
keyword: #pfreq=noraman
keyword: PBEPBE/SDD
title: #p freq=noraman PBEPBE/SDD
converged: YES YES NO NO
title: Mulliken charges:
elementType: O C C C C C C C C C C C C C C C C C C C C C C C C C C H H H H H H H H H H H H H H H H H H H H H H H H H H
charge: -0.453830 -0.193151 0.139263 -0.122044 -0.463657 0.060690 -0.435046 -0.409942 0.019002 -0.388617 0.315202 -0.571734 -0.018067 -0.514722 0.273956 -0.429461 -0.426479 -0.059225 -0.418020 -0.447872 0.499644 0.502905 -0.575839 -0.524980 -0.475424 -0.475617 -0.248361 0.232525 0.199006 0.219091 0.210976 0.221130 0.208190 0.194539 0.205809 0.193449 0.204077 0.260748 0.214001 0.226412 0.219701 0.204578 0.210291 0.203855 0.210530 0.225600 0.248576 0.346902 0.234136 0.236030 0.242454 0.242316 0.226507
chargesum: 0.00000
title: Mulliken charges with hydrogens summed into heavy atoms:
elementType: O C C C C C C C C C C C C C C C C C C C C C C C C C C
charge: -0.106928 0.039374 0.139263 0.076962 -0.033591 0.060690 -0.005727 -0.009594 0.019002 0.008909 0.315202 -0.096985 -0.018067 -0.068609 0.273956 -0.014592 -0.012094 -0.059225 -0.192420 -0.199296 0.499644 0.502905 -0.341703 -0.288950 -0.232970 -0.233300 -0.021853
polarizability: 4.24159851e+02 3.70093113e+01 3.39353432e+02 -6.39283180e+00 -8.09774895e-01 1.57999676e+02
1716.lowfreq: -10.4579 -9.3858 -2.8945 -0.0008 -0.0005 0.0005 33.6658 51.4439 54.2035
frequency: 33.6039 51.4316 54.1854 58.5341 102.8675 124.9384 137.1595 145.5937 172.9717 202.8773 209.9517 212.9272 229.1258 259.3777 290.7065 312.0211 324.8779 331.9376 343.7135 369.8894 378.4117 386.1584 398.0043 413.3650 439.2135 452.5913 466.8361 481.4727 491.2274 512.9451 519.4118 521.9505 527.6065 535.5821 557.5688 577.0021 589.1031 634.1922 653.5722 703.8475 706.7520 731.6754 742.0101 766.5676 782.4526 791.4194 815.8698 819.0413 829.4332 839.3983 851.7647 861.7256 868.8606 881.5403 891.9207 894.5488 908.3198 913.3697 920.5577 944.7106 950.9327 968.3641 978.4256 984.0039 987.9256 1004.5714 1015.2158 1041.2600 1051.7298 1067.9150 1082.7500 1084.4653 1096.0036 1104.3673 1106.6679 1116.0572 1123.7599 1134.3161 1140.0565 1172.0989 1180.0908 1190.9681 1194.5006 1198.0922 1227.1379 1231.7632 1235.2482 1257.1746 1258.6267 1262.0023 1270.2079 1281.1163 1291.6250 1297.8960 1312.8057 1318.5310 1327.0644 1331.6702 1336.4410 1338.5922 1340.6729 1343.8314 1349.9247 1358.7729 1371.5020 1376.9271 1389.1868 1401.0319 1409.9400 1425.3709 1427.7183 1454.2083 1463.0821 1463.7886 1465.8191 1468.7800 1471.3676 1471.9593 1476.4522 1478.8559 1488.1125 1496.1349 1531.3594 1585.8287 1590.9264 1608.6849 1634.8808 2950.3150 2952.3538 2965.9690 2967.5951 2969.1145 2976.0655 2978.0568 2986.6194 2994.7085 3013.7515 3022.1505 3029.2004 3031.1525 3036.5206 3040.4970 3046.9186 3053.9912 3061.3379 3120.7699 3124.2277 3125.0907 3130.2852 3155.8026 3165.9964 3193.5610 3532.4875
redmass: 4.2395 4.2413 3.9043 3.6110 3.3320 3.4765 3.0126 3.9097 4.0819 2.7661 3.6803 3.3837 4.3735 3.9078 2.6728 1.6725 3.7909 2.5233 2.3764 3.0330 3.6213 1.8382 2.3273 3.8924 3.7481 3.3111 3.5597 3.7732 6.0151 3.1861 3.8167 3.5774 3.6136 2.7308 4.5403 4.1227 3.5919 4.2073 4.2553 4.4578 4.1942 3.3340 2.4291 1.2498 1.8939 4.6380 3.6172 1.4690 1.8924 2.3930 2.1779 2.9105 2.2186 2.3931 2.3251 2.0795 1.7539 1.5344 2.0015 2.6171 2.9534 1.3445 1.4076 2.2682 1.5531 3.8183 3.6395 1.8609 1.5969 2.6248 1.9470 1.9187 1.5383 2.2686 1.8237 1.9585 2.3611 1.8261 1.2321 1.5701 1.2921 1.5058 1.6952 1.3443 1.3326 1.6390 1.3982 1.3021 1.3558 1.6739 1.3221 2.2213 1.5186 1.4138 1.4018 1.4072 1.4303 1.4956 1.5239 1.6011 1.9068 1.6006 1.7112 1.5361 2.0830 1.9952 2.3727 3.0295 2.4012 3.2306 3.6038 1.4199 1.1219 1.1076 1.3397 1.3299 1.0912 1.2979 1.1538 1.1763 5.0673 2.8377 5.0887 8.1663 5.7080 6.5648 7.3583 1.0657 1.0643 1.0716 1.0663 1.0696 1.0664 1.0608 1.0626 1.0621 1.0933 1.0935 1.0912 1.0909 1.0977 1.0977 1.1040 1.1014 1.0986 1.0864 1.0895 1.0891 1.0914 1.0991 1.0940 1.0919 1.0655
irintensity: 0.1452 0.3458 0.6798 0.5403 0.4365 1.9950 0.6951 0.4381 0.2266 5.3972 3.2056 3.6556 0.5252 0.0901 1.8654 0.0463 3.1729 5.4801 34.1355 6.0391 4.4810 55.6642 48.8818 1.6201 0.3036 1.5518 0.2039 0.1971 0.7841 3.2180 6.2119 0.5960 0.2402 3.8068 1.2157 0.5873 0.0798 1.8949 8.1579 2.5668 1.2511 1.8611 28.5958 9.5099 1.7950 3.8298 4.5792 1.5084 23.9600 9.1525 10.1709 5.9880 87.5155 2.0181 3.3923 4.9427 1.8939 0.3003 1.1455 13.6445 5.7842 0.0627 1.3304 4.1309 10.6383 37.5100 5.4590 0.5683 1.4465 5.2024 1.4290 4.4985 15.3535 4.0692 0.8883 7.1897 2.5329 0.1078 1.4629 0.7667 0.0719 5.2689 1.8179 13.6990 16.6441 2.5412 3.0491 15.4408 11.9675 6.1833 3.2583 16.5387 2.8527 10.3896 4.9058 1.5431 1.8907 4.8269 0.6678 1.0033 0.6578 4.9827 1.6149 0.1786 6.2508 9.7302 2.9934 3.7309 3.8897 2.2852 3.9183 11.9092 7.3241 5.4716 2.0686 10.5432 15.3754 8.8568 9.1798 5.7861 17.4396 1.6069 1.3617 3.9609 11.8009 1.9162 0.4003 27.4274 17.3286 23.1671 17.3625 53.3363 43.6875 32.6061 30.8437 21.8866 31.5603 2.2939 33.7165 72.8066 41.8189 90.5793 55.8315 12.3925 85.0432 0.5027 8.0497 2.4809 25.2673 49.2398 24.7059 20.5683 1.1972
temp: 298.150 k
press: 1.00000 atm
elementType: 8 6 6 6 6 6 6 6 6 6 6 6 6 6 6 6 6 6 6 6 6 6 6 6 6 6 6 1 1 1 1 1 1 1 1 1 1 1 1 1 1 1 1 1 1 1 1 1 1 1 1 1 1
symmnumber: 1
zpe: 1175287.9 jmol-1
zpe.correction: 0.447644 hartree
zpe.thermalcorrener: 0.469000 hartree
zpe.thermalcorrenthalpy: 0.469944 hartree
zpe.thermalcorrgfe: 0.398765 hartree
zpe.sumelectzpe: -1079.734003 hartree
zpe.sumelectthermal: -1079.712647 hartree
zpe.sumelectthermalent: -1079.711702 hartree
zpe.sumelectthermalfe: -1079.782882 hartree
dipole: -0.2109 0.5582 -1.4178
dipole: 1.5382
quadrupole: -150.2545 -141.2705 -169.3030
quadrupole: -1.0928 -8.2814 0.5458
quadrupole: 3.3548 12.3388 -15.6937 -1.0928 -8.2814 0.5458
hfenergy: -1080.1816463 hartree
pointgroup: C01 [X(C26H26O1)]
dipole: -0.0696252 -0.2341204 0.5537029 debye
polarizability: 428.4227023|-31.5593226|335.0400673|6.1105289|2.6716474|158.0501894 unknown
InChI: InChI=1S/C26H26O/c27-23-11-4-3-10-21(23)25-19-9-2-1-8-18(19)20-14-12-16-6-5-7-17-13-15-22(25)26(20)24(16)17/h5-7,12-15,21,23,27H,1-4,8-11H2
charge 0 multiplicity 1
53 atoms
O  2.940301 0.676195 -2.234223
C  2.541118 0.720346 0.230007
C  1.211166 -0.045333 0.101445
C  2.927127 1.543003 -1.039425
C  2.691142 1.56671 1.533739
C  1.248081 -1.481523 0.037356
C  4.341729 2.125744 -0.908426
C  4.119894 2.152853 1.635886
C  0.045757 -2.245118 0.053952
C  4.483703 2.976006 0.376576
C  -0.056158 0.629566 0.072376
C  2.603508 -2.197059 -0.075629
C  -1.281327 -0.140808 0.028037
C  0.064996 -3.775458 0.097853
C  -1.222596 -1.580557 0.037745
C  2.506938 -3.684023 -0.470757
C  1.448123 -4.384924 0.394296
C  -2.562713 0.522279 -0.010507
C  -0.184611 2.078061 0.059679
C  -2.469283 -2.320775 0.00227
C  -2.642899 1.961749 -0.016858
C  -3.785188 -0.244084 -0.044169
C  -1.410911 2.71169 0.015153
C  -3.695331 -1.684181 -0.038343
C  -3.912335 2.598738 -0.056094
C  -5.037595 0.428274 -0.082246
C  -5.099507 1.836915 -0.088163
H  3.344758 -0.032462 0.30612
H  2.207366 2.373248 -1.199205
H  2.477306 0.917267 2.404298
H  1.956294 2.390969 1.577713
H  4.570132 2.724752 -1.809321
H  5.062333 1.284014 -0.887494
H  4.850332 1.325067 1.749198
H  4.203372 2.781709 2.543308
H  3.81978 3.863435 0.31371
H  5.518281 3.360754 0.45649
H  3.229904 -1.669057 -0.818554
H  3.142041 -2.124591 0.893044
H  -0.656927 -4.126067 0.860314
H  -0.301898 -4.171532 -0.872972
H  2.225162 -3.775288 -1.539306
H  3.499229 -4.159365 -0.356652
H  1.701962 -4.248824 1.464868
H  1.424373 -5.473876 0.201473
H  0.713505 2.694826 0.074981
H  -2.439652 -3.413379 -0.004546
H  2.031703 0.292193 -2.345747
H  -1.464347 3.806814 0.000405
H  -4.623187 -2.267728 -0.069602
H  -3.959622 3.69406 -0.060862
H  -5.959622 -0.164373 -0.106988
H  -6.071509 2.34115 -0.118004
