program: Gaussian 09
title: 000183149
version: EM64L-G09RevD.01
frameworkgroup: C1[X(C14H13ClN2O4)]
method: RPBEPBE
basis: SDD
operation: Freq
keyword: #p
keyword: freq=noraman
keyword: PBEPBE/SDD
title: #p freq=noraman PBEPBE/SDD
converged: YES YES NO NO
title: Mulliken charges:
elementType: Cl O O O O N N C C C C C C C C C C C C C C H H H H H H H H H H H H H
charge: 0.001327 -0.147515 -0.403110 -0.151421 -0.228949 0.037068 -0.018018 0.183690 -0.704681 -0.727496 -0.707590 0.069017 0.122225 0.095818 0.265426 0.248207 -0.338319 -0.318204 -0.253545 -0.222354 -0.115096 0.222304 0.234473 0.240861 0.249953 0.219972 0.212099 0.247478 0.209278 0.227233 0.284977 0.307248 0.276128 0.381513
chargesum: 0.00000
title: Mulliken charges with hydrogens summed into heavy atoms:
elementType: Cl O O O O N N C C C C C C C C C C C C C C
charge: 0.001327 -0.147515 -0.021597 -0.151421 -0.228949 0.037068 -0.018018 0.183690 -0.007043 -0.045472 -0.023600 0.069017 0.122225 0.095818 0.265426 0.248207 -0.053342 -0.010955 -0.253545 0.053774 -0.115096
polarizability: 2.76721831e+02 -3.41364991e+00 2.03462724e+02 -9.51878414e-01 -3.90289446e+00 1.25733757e+02
1716.lowfreq: -4.6723 -1.5905 -0.0013 -0.0012 0.0016 2.6154 23.6494 28.6335 31.1220
frequency: 23.3245 28.5775 31.0730 42.5125 49.1433 56.6075 109.7552 123.5788 134.3800 147.3396 161.2134 190.4353 197.7087 214.2551 236.9762 253.5962 268.4174 270.7867 286.0690 312.0393 331.4510 345.5825 362.3678 370.1259 378.4801 425.8435 428.8093 444.3727 454.4455 483.3050 549.2801 568.2370 583.9027 600.6120 641.0836 652.0329 687.4649 700.9022 707.4462 736.3093 740.2132 779.7964 815.3992 841.3158 853.3814 904.6681 929.2706 937.7634 955.8654 973.4558 975.3646 1010.9943 1033.3344 1058.3727 1097.1806 1118.7442 1144.0499 1151.6393 1191.9894 1196.0143 1234.9858 1251.3988 1258.2222 1291.3080 1300.7455 1342.6568 1372.4967 1378.0906 1381.0980 1402.4635 1406.0572 1455.1304 1464.2394 1468.4714 1470.3934 1475.8753 1482.1179 1499.3115 1548.0871 1592.5002 1600.1900 1618.1942 2139.5491 2978.7151 2980.6719 2987.9576 3071.8867 3077.5946 3083.3210 3088.3486 3091.9673 3102.2880 3170.6623 3187.1499 3189.4684 3197.8762
redmass: 5.2553 4.4311 4.3828 10.4663 8.5969 13.2589 6.4559 11.3028 8.0182 5.9899 9.2518 5.0440 1.5071 1.7731 6.7020 1.1500 1.1907 2.8728 4.9845 8.2771 4.0277 2.9965 2.3253 7.5934 6.1187 5.7572 4.2540 7.3578 6.1300 6.5817 5.1193 4.8733 7.5487 5.7055 5.4725 5.9020 4.9487 1.8225 5.9979 5.1329 3.3249 5.8176 3.5004 1.7523 3.4841 1.4656 1.7888 1.5506 1.2048 1.4344 3.5203 1.4372 1.5247 3.7495 4.0979 2.8804 3.7365 1.9427 2.5861 6.9811 3.3950 2.9143 1.8131 2.4237 1.7708 3.4688 1.1774 1.2506 4.3695 1.2082 5.5284 1.0494 2.4650 1.0589 1.0554 1.0553 1.0512 1.0654 8.2412 6.8204 8.5835 8.5311 12.5966 1.0345 1.0350 1.0356 1.0995 1.1002 1.1002 1.1003 1.1005 1.0996 1.0893 1.0954 1.0948 1.0664
irintensity: 1.4617 0.2026 0.5032 1.9440 0.5320 2.6697 0.7152 4.3284 1.0027 0.3288 0.8541 0.9334 1.5411 1.6253 2.6897 1.1383 0.6863 1.9713 15.0948 1.2712 7.2549 1.8441 0.2363 0.4435 11.6644 1.6352 3.0960 1.0225 0.4421 11.0203 9.4756 12.4541 6.7945 0.4397 5.7722 9.5860 29.6705 59.0250 22.1030 19.1865 45.5650 4.9227 6.9190 27.6512 73.7190 19.2490 2.3603 7.8966 0.8189 12.6712 91.2211 0.6683 4.7451 83.1220 27.4668 48.4659 39.0201 32.9493 35.7694 218.1691 9.9578 16.0150 38.2244 55.2522 315.1668 10.0990 17.1089 21.7534 47.6230 15.8649 33.9125 0.7501 124.7027 3.0069 2.2827 10.8733 18.2633 38.1717 12.8980 21.7826 108.3051 53.2314 43.1187 21.0564 23.7574 26.8839 25.8717 34.0295 27.0719 32.0059 17.9426 20.4911 0.1350 2.0468 3.2193 558.2560
temp: 298.150 k
press: 1.00000 atm
elementType: 17 8 8 8 8 7 7 6 6 6 6 6 6 6 6 6 6 6 6 6 6 1 1 1 1 1 1 1 1 1 1 1 1 1
symmnumber: 1
zpe: 639644.1 jmol-1
zpe.correction: 0.243628 hartree
zpe.thermalcorrener: 0.264948 hartree
zpe.thermalcorrenthalpy: 0.265892 hartree
zpe.thermalcorrgfe: 0.191264 hartree
zpe.sumelectzpe: -1410.094666 hartree
zpe.sumelectthermal: -1410.073346 hartree
zpe.sumelectthermalent: -1410.072402 hartree
zpe.sumelectthermalfe: -1410.147030 hartree
dipole: 1.7139 -2.1969 -4.8055
dipole: 5.5549
quadrupole: -122.3938 -141.0296 -138.0368
quadrupole: 1.3723 5.0282 3.5418
quadrupole: 11.4263 -7.2095 -4.2168 1.3723 5.0282 3.5418
hfenergy: -1410.3382938 hartree
pointgroup: C01 [X(C14H13Cl1N2O4)]
dipole: -0.6384453 -1.4566074 1.4989996 debye
polarizability: 276.6082938|2.7391978|191.1373528|-5.8470666|28.4245376|138.1726658 unknown
InChI: InChI=1S/C14H13ClN2O4/c1-14(2,3)13(19)10(7-16)12(18)9-5-4-8(15)6-11(9)17(20)21/h4-6,18H,1-3H3
charge 0 multiplicity 1
34 atoms
Cl -5.591018 -1.506381 0.060943
O  3.004969 1.26971 -1.042981
O  0.890245 0.843264 1.440842
O  -2.964033 3.031569 0.371931
O  -0.988635 2.63333 1.400923
N  -2.044611 2.227191 0.75437
N  0.638479 -1.760237 -2.680194
C  3.728763 -0.74873 0.15971
C  4.408604 -1.53803 -1.009116
C  3.075252 -1.73971 1.153087
C  4.785013 0.126946 0.883049
C  2.693317 0.179515 -0.510493
C  1.220702 -0.284879 -0.592905
C  0.335395 0.168313 0.363498
C  -1.132309 -0.143588 0.3461
C  -2.221047 0.774587 0.493481
C  -1.49617 -1.501184 0.119554
C  -3.573547 0.372525 0.391871
C  0.865283 -1.083365 -1.714441
C  -2.833911 -1.930414 0.035613
C  -3.865317 -0.979445 0.169283
H  5.168236 -2.221427 -0.587331
H  3.679661 -2.14421 -1.577381
H  4.908422 -0.845284 -1.708475
H  2.524782 -1.205287 1.947028
H  3.863805 -2.348992 1.631025
H  2.380197 -2.433095 0.644723
H  5.21027 0.877243 0.195867
H  5.60237 -0.512256 1.263916
H  4.332126 0.661737 1.737067
H  -0.702695 -2.244742 0.012112
H  -4.363085 1.121889 0.485473
H  -3.065496 -2.985402 -0.133044
H  0.242686 1.546941 1.766392
