program: Gaussian 09
title: 000183136
version: EM64L-G09RevD.01
frameworkgroup: C1[X(C12H5BrClF3N4O4)]
method: RPBEPBE
basis: SDD
operation: Freq
keyword: #p
keyword: freq=noraman
keyword: PBEPBE/SDD
title: #p freq=noraman PBEPBE/SDD
converged: YES YES NO NO
title: Mulliken charges:
elementType: Br Cl F F F O O O O N N N N C C C C C C C C C C C C H H H H H
charge: 0.052556 0.114792 -0.155562 -0.145382 -0.147807 -0.177709 -0.139776 -0.172064 -0.246290 -0.428170 0.002644 0.022000 -0.043508 0.276560 0.556578 0.242146 0.457032 -0.562166 -0.599067 0.269434 0.189861 -0.327520 -0.074367 -0.303123 -0.145775 0.329437 0.355477 0.258869 0.267236 0.273665
chargesum: 0.00000
title: Mulliken charges with hydrogens summed into heavy atoms:
elementType: Br Cl F F F O O O O N N N N C C C C C C C C C C C C
charge: 0.052556 0.114792 -0.155562 -0.145382 -0.147807 -0.177709 -0.139776 -0.172064 -0.246290 -0.072693 0.002644 0.022000 -0.043508 0.276560 0.556578 0.242146 0.457032 -0.562166 -0.269630 0.269434 0.189861 -0.068651 0.192869 -0.029458 -0.145775
polarizability: 3.86174278e+02 -2.20010710e+01 2.41897481e+02 1.19334519e+01 1.18122423e+01 1.08965015e+02
1716.lowfreq: -1.3761 0.0018 0.0021 0.0023 2.5886 4.2906 20.4795 29.7389 39.4281
frequency: 20.4791 29.7325 39.4158 44.9108 59.3285 65.7587 89.6732 105.1567 117.0760 132.7931 141.2331 162.7022 188.6600 197.0336 224.8128 237.1136 253.4297 268.5800 286.2764 295.8847 311.5500 326.4417 350.7634 379.2937 382.4115 407.4030 417.4469 442.0459 479.4266 505.6789 508.7135 532.8649 570.1162 597.6100 605.7583 623.8550 647.9705 667.7242 689.7387 701.4970 706.7796 711.5372 741.8546 747.2472 805.3436 817.6457 833.1097 862.3887 904.4214 921.9099 930.7596 953.6860 969.1443 971.9882 1006.8166 1028.0957 1071.0639 1077.7035 1135.4999 1141.4680 1157.8986 1201.3094 1224.2235 1260.2557 1281.1779 1313.6774 1330.7724 1337.5227 1346.9945 1367.3393 1390.4225 1408.4508 1447.0887 1480.4593 1497.8882 1544.5073 1563.1850 1602.7936 1614.7915 3156.0494 3163.3786 3163.8816 3180.8091 3188.7911
redmass: 17.3288 18.4947 6.1635 17.9643 15.8208 9.5442 12.8443 14.7113 11.7247 11.4499 14.8089 13.8125 12.4008 11.5435 21.0026 9.0029 9.7329 9.9196 16.7507 9.8422 12.0224 12.5606 6.2568 9.1835 11.7468 7.7956 4.1059 9.7042 10.4988 6.4615 4.2074 8.3714 10.0170 10.0008 10.9100 9.2672 7.6992 10.1770 10.0575 9.3880 8.6185 11.0764 4.8438 9.4353 10.5918 1.3955 1.9408 5.3844 3.3260 1.4207 7.0290 1.4756 1.3661 5.5811 7.8189 12.5150 10.1171 2.8424 1.7488 2.0482 5.1750 7.3591 4.1897 2.3898 2.9850 2.1210 6.0013 9.9524 3.0920 3.6486 10.6871 11.2865 2.4940 7.8910 4.0114 6.4671 6.3090 2.1482 6.2223 1.0911 1.0870 1.0860 1.0976 1.0916
irintensity: 0.0819 0.2240 2.5986 0.0209 1.3143 0.9803 0.2667 2.0475 1.1394 0.4902 1.8435 0.7756 1.1090 3.4966 0.8971 0.2121 1.9151 2.7223 1.7114 7.6390 0.6352 11.6189 2.1999 0.4485 0.2678 8.9321 3.8510 3.1701 4.1421 1.7905 30.1803 3.0265 11.4723 13.7221 31.8412 16.9683 6.2018 0.4810 21.7375 10.2118 3.6199 8.7421 6.0759 1.5849 25.0837 19.5374 61.3119 34.6753 34.5629 4.7561 28.4481 84.2421 0.6405 43.0704 180.8993 99.1879 220.6827 59.3508 61.0076 68.1717 374.2569 171.1752 79.7405 42.9419 170.9461 12.0427 30.5738 329.6905 8.4237 41.0040 72.4801 72.9692 284.3927 194.4534 66.1230 37.6837 59.9279 355.1237 202.8375 5.1912 88.1888 61.7570 1.5459 27.0499
temp: 298.150 k
press: 1.00000 atm
elementType: 35 17 9 9 9 8 8 8 8 7 7 7 7 6 6 6 6 6 6 6 6 6 6 6 6 1 1 1 1 1
symmnumber: 1
zpe: 440647.4 jmol-1
zpe.correction: 0.167834 hartree
zpe.thermalcorrener: 0.189871 hartree
zpe.thermalcorrenthalpy: 0.190816 hartree
zpe.thermalcorrgfe: 0.113549 hartree
zpe.sumelectzpe: -1751.264063 hartree
zpe.sumelectthermal: -1751.242025 hartree
zpe.sumelectthermalent: -1751.241081 hartree
zpe.sumelectthermalfe: -1751.318348 hartree
dipole: 3.4905 1.9244 0.5379
dipole: 4.0220
quadrupole: -161.9791 -170.5755 -159.8300
quadrupole: 8.2836 -1.9483 6.0051
quadrupole: 2.1491 -6.4473 4.2982 8.2836 -1.9483 6.0051
hfenergy: -1751.4318969 hartree
pointgroup: C01 [X(C12H5Br1Cl1F3N4O4)]
dipole: 1.4867905 -0.4920718 -0.2262688 debye
polarizability: 370.5008444|46.2778302|256.2556072|-28.3199168|-5.6317774|110.2803223 unknown
InChI: InChI=1S/C12H5BrClF3N4O4/c13-5-1-2-8(18-4-5)19-10-7(20(22)23)3-6(12(15,16)17)9(14)11(10)21(24)25/h1-4,19H
charge 0 multiplicity 1
30 atoms
Br 6.324735 2.319047 0.221513
Cl -2.618966 2.606161 -0.444524
F  -4.924934 -0.892256 1.264261
F  -4.421715 1.264972 1.724267
F  -5.051767 0.664252 -0.37146
O  0.78817 1.274614 -2.18247
O  0.279425 2.863475 -0.626979
O  -1.502421 -3.86667 0.994318
O  0.520521 -3.481205 0.030686
N  1.241116 -1.025292 -0.384291
N  0.213101 1.676664 -1.097687
N  -0.65867 -3.069688 0.442095
N  2.356242 0.937722 0.356432
C  -0.071955 -0.662344 -0.181449
C  -0.614015 0.660133 -0.389987
C  -1.024875 -1.661713 0.252236
C  -2.841547 -0.031697 0.398871
C  -1.958306 0.969522 -0.102445
C  -2.36151 -1.335998 0.54379
C  -4.283097 0.254816 0.745041
C  2.416446 -0.241136 -0.31739
C  3.617436 -0.753997 -0.872111
C  4.796385 -0.0004 -0.714526
C  3.48877 1.673539 0.49332
C  4.727753 1.229734 -0.021867
H  -3.018651 -2.132828 0.899863
H  1.356688 -2.061672 -0.407502
H  3.627682 -1.69969 -1.422214
H  5.742571 -0.357216 -1.129978
H  3.395788 2.626249 1.022987
