program: Gaussian 09
title: 000183150
version: EM64L-G09RevD.01
frameworkgroup: C1[X(C19H28O4)]
method: RPBEPBE
basis: SDD
operation: Freq
keyword: #pfreq=noraman
keyword: PBEPBE/SDD
title: #p freq=noraman PBEPBE/SDD
converged: YES YES NO NO
title: Mulliken charges:
elementType: O O O O C C C C C C C C C C C C C C C C C C C H H H H H H H H H H H H H H H H H H H H H H H H H H H H
charge: -0.445948 -0.195087 -0.417814 -0.238591 0.513873 -0.163507 0.394457 -0.024195 -0.627775 -0.135700 -0.650014 -0.611917 -0.549091 -0.115765 -0.483791 -0.440219 -0.544814 -0.222640 -0.859653 -0.140086 -0.485101 -0.138363 0.135574 0.189784 0.188141 0.214850 0.234278 0.220122 0.268752 0.230563 0.200977 0.210829 0.219331 0.244741 0.240335 0.219371 0.211098 0.208498 0.195722 0.199643 0.219740 0.239589 0.217860 0.251918 0.232538 0.257284 0.239199 0.218188 0.168035 0.331438 0.373344
chargesum: 0.00000
title: Mulliken charges with hydrogens summed into heavy atoms:
elementType: O O O O C C C C C C C C C C C C C C C C C C C
charge: -0.114509 -0.195087 -0.044470 -0.238591 0.513873 0.026277 0.394457 0.163947 -0.178648 0.084422 -0.150699 -0.200112 -0.085019 0.124570 -0.053321 -0.035999 -0.125431 0.016949 -0.157336 0.117198 -0.027714 0.029671 0.135574
polarizability: 2.25725477e+02 -1.01073604e+00 1.93946313e+02 4.64920421e+00 4.52969250e+00 1.80104869e+02
1716.lowfreq: -13.9465 -7.0920 -0.0009 -0.0008 -0.0007 14.7191 35.1812 48.3437 60.4379
frequency: 35.1311 48.3366 60.4350 83.0150 94.2818 116.8665 125.4464 151.8974 160.3057 188.2682 221.1076 247.4865 256.4055 264.2894 275.2489 279.7726 288.7980 299.2327 306.8788 323.8396 330.5644 343.7751 372.2066 376.4478 401.8049 414.2593 422.3438 441.5739 468.0519 489.0952 512.6642 539.1587 552.3715 570.6589 619.2742 631.2650 635.8450 679.3481 695.8429 719.3082 749.3352 755.2909 786.2954 803.0856 819.6311 837.6722 852.0543 878.7865 882.1226 895.2876 903.9457 926.5476 941.5492 945.7891 962.2043 969.6471 974.5664 980.9313 986.5456 995.9237 1001.2071 1030.7216 1039.8415 1046.0829 1054.7805 1070.1682 1076.8865 1082.7334 1091.0840 1100.9120 1116.7833 1128.0255 1141.5657 1145.2747 1150.5965 1172.1115 1176.1665 1186.8125 1196.9755 1201.1260 1206.9547 1223.7400 1230.9650 1244.3123 1254.9551 1267.2251 1267.8307 1280.6141 1282.6258 1293.3241 1296.3244 1301.9204 1312.4072 1318.3349 1323.2203 1327.0855 1329.7273 1340.1872 1345.3956 1348.5319 1350.1427 1358.8690 1365.5991 1384.5654 1385.4059 1403.5525 1405.4959 1456.1799 1458.0440 1463.4835 1467.7331 1471.7262 1474.2073 1474.7150 1489.3490 1499.0115 1504.5328 1631.6076 1649.4555 2845.4420 2913.0124 2921.0920 2948.0949 2950.9447 2956.1421 2967.2219 2969.9640 2991.1279 2992.1859 2996.3853 3000.6574 3001.5601 3004.7072 3007.5634 3010.5562 3017.8440 3021.9685 3023.7308 3038.0423 3048.1088 3057.4093 3071.2054 3084.3202 3091.8527 3099.7194 3500.4262 3558.4090
redmass: 7.2962 6.4015 8.1431 4.1056 4.5086 4.0099 4.5099 4.4868 2.8992 3.2061 3.2373 1.1906 2.1322 2.6712 1.9902 1.9079 2.2330 3.2154 2.7947 2.8437 3.3591 2.6770 4.4937 3.3373 2.8662 2.1279 2.9845 2.4876 2.3344 2.8440 2.5360 2.8724 2.8779 3.3020 1.8154 2.7240 2.2738 4.0201 3.3932 3.2916 3.3452 3.0683 2.9990 3.4034 2.2594 2.2397 2.1387 1.6760 2.2088 1.8267 2.3189 2.0231 2.0359 2.1611 2.0431 2.0181 2.3803 3.4128 1.7193 2.1778 2.5067 2.2851 1.9300 2.3149 1.9687 1.6628 1.9225 1.9099 1.9128 1.9301 1.6249 1.8280 1.9615 1.8722 1.3447 1.5550 1.7467 1.7311 1.7020 1.7969 1.3896 1.5388 1.3774 1.5559 1.5637 1.4482 1.3897 1.4369 1.3392 1.5339 1.3160 1.4783 1.5388 1.6746 1.4295 1.4316 1.5183 1.4162 1.3621 1.3802 1.4700 1.4006 1.4079 1.4244 1.2664 1.1908 1.5776 1.0903 1.0892 1.0846 1.0948 1.0866 1.0864 1.0832 1.0722 1.0654 1.0560 8.0291 7.6991 1.0835 1.0813 1.0811 1.0615 1.0819 1.0590 1.0604 1.0607 1.0708 1.0696 1.0717 1.0717 1.0456 1.0731 1.0744 1.0854 1.0988 1.0884 1.0957 1.1026 1.1011 1.1007 1.1009 1.0973 1.0956 1.0964 1.0638 1.0661
irintensity: 0.7983 1.6541 3.4725 3.5913 0.9568 4.2091 2.1117 0.7982 1.1336 2.3282 4.1066 1.8219 1.6467 2.4876 26.3327 71.0086 37.4832 11.3509 3.1851 0.1153 0.4577 1.7949 3.0379 9.0335 0.5017 0.1900 3.6993 2.5408 4.1208 8.4295 8.1544 12.6897 19.9706 3.1606 99.1984 1.9940 40.2251 6.2782 24.2702 9.5405 4.4835 4.5097 0.1789 2.0445 2.3022 2.8277 2.1810 4.2810 1.8527 1.3132 16.8334 5.6723 2.3095 1.6251 7.4320 13.9677 14.4862 42.0571 11.9254 3.5785 46.5008 55.0793 1.7211 224.3492 24.7299 0.7867 1.8208 1.4984 13.2140 8.5275 8.6900 6.3618 6.4461 8.1951 2.8869 9.1195 7.8245 15.1391 5.0165 10.0710 12.5503 9.6740 0.7660 2.7384 8.3538 4.9092 1.3808 11.8091 5.9960 3.0031 0.5204 0.7613 7.8578 7.8452 4.3282 6.5904 6.3960 6.9657 2.6586 2.0893 3.8359 2.3424 14.3168 8.2343 1.5677 19.2723 3.7095 3.9973 1.3523 14.8943 9.5090 20.0898 14.5939 8.5717 2.0252 12.5851 13.4955 106.7783 184.2013 136.6103 6.2198 39.6786 32.4001 26.6632 33.0390 38.2689 47.9400 12.1125 14.9326 9.2489 31.0152 11.0370 4.6011 29.6377 71.6638 25.6888 75.5657 68.2781 35.1410 48.2242 44.5922 26.1073 20.7462 13.5199 13.3049 22.9708 4.4368
temp: 298.150 k
press: 1.00000 atm
elementType: 8 8 8 8 6 6 6 6 6 6 6 6 6 6 6 6 6 6 6 6 6 6 6 1 1 1 1 1 1 1 1 1 1 1 1 1 1 1 1 1 1 1 1 1 1 1 1 1 1 1 1
symmnumber: 1
zpe: 1152476.5 jmol-1
zpe.correction: 0.438955 hartree
zpe.thermalcorrener: 0.460192 hartree
zpe.thermalcorrenthalpy: 0.461136 hartree
zpe.thermalcorrgfe: 0.390680 hartree
zpe.sumelectzpe: -1039.925917 hartree
zpe.sumelectthermal: -1039.904680 hartree
zpe.sumelectthermalent: -1039.903736 hartree
zpe.sumelectthermalfe: -1039.974192 hartree
dipole: -2.9429 -1.5317 -2.9127
dipole: 4.4148
quadrupole: -142.1774 -132.3249 -148.9885
quadrupole: -6.7035 8.3050 0.2743
quadrupole: -1.0138 8.8387 -7.8249 -6.7035 8.3050 0.2743
hfenergy: -1040.3648724 hartree
pointgroup: C01 [X(C19H28O4)]
dipole: 1.164223 0.5481378 -1.1665999 debye
polarizability: 225.6230979|-1.8117403|193.7570102|-4.9188032|-4.7856972|180.3965511 unknown
InChI: InChI=1S/C19H28O4/c1-18-9-13(21)6-14(17(22)23)15(18)4-5-19-7-11(2-3-16(18)19)12(8-19)10-20/h10-16,21-22H,2-9H2,1H3
charge 0 multiplicity 1
51 atoms
O  -3.55369 -3.077726 -0.123991
O  3.592562 -0.186979 2.683053
O  -3.282923 2.778887 0.52658
O  -3.793956 0.885054 1.74905
C  1.583424 0.68633 -0.905356
C  0.787377 -0.649052 -0.64225
C  -0.647219 -0.483561 0.018601
C  -1.422205 0.558905 -0.867093
C  2.785993 0.32879 -1.835604
C  3.738139 -0.423952 -0.881977
C  2.330297 1.207441 0.377134
C  0.682854 1.746613 -1.585537
C  1.696906 -1.675354 0.089384
C  3.758261 0.578907 0.339451
C  -0.698492 1.922519 -0.923452
C  3.111202 -1.800434 -0.539346
C  -1.39275 -1.854993 -0.096991
C  -2.968928 0.654655 -0.595526
C  -0.592465 -0.063972 1.514832
C  -2.905862 -1.785472 0.201558
C  -3.61736 -0.749814 -0.678161
C  4.247768 -0.069781 1.617877
C  -3.373002 1.383379 0.679436
H  0.577961 -1.061965 -1.657321
H  -1.383235 0.144996 -1.902001
H  3.258518 1.25546 -2.220146
H  2.479339 -0.28457 -2.703873
H  4.751574 -0.564094 -1.302668
H  1.828977 0.935708 1.318426
H  2.395937 2.311198 0.350625
H  0.520517 1.44207 -2.641994
H  1.221578 2.715059 -1.618404
H  1.220405 -2.673355 0.090142
H  1.807937 -1.382248 1.148831
H  4.516547 1.352381 0.086951
H  -0.595745 2.359349 0.086946
H  -1.304044 2.644328 -1.504374
H  3.766526 -2.369425 0.150381
H  3.057077 -2.387982 -1.478255
H  -0.928412 -2.590845 0.590225
H  -1.279704 -2.25331 -1.127172
H  -3.371675 1.281894 -1.415146
H  -0.248238 0.974691 1.651927
H  -1.58259 -0.142678 1.991556
H  0.092242 -0.715301 2.08559
H  -3.081216 -1.545222 1.268254
H  -4.685046 -0.711224 -0.399217
H  -3.560704 -1.104446 -1.72589
H  5.293752 -0.472918 1.553743
H  -3.196642 -3.771358 0.486994
H  -3.567468 3.211214 1.378194
