program: Gaussian 09
title: 000183123
version: EM64L-G09RevD.01
frameworkgroup: C1[X(C12H4Cl2F3N5O6)]
method: RPBEPBE
basis: SDD
operation: Freq
keyword: #p
keyword: freq=noraman
keyword: PBEPBE/SDD
title: #p freq=noraman PBEPBE/SDD
converged: YES YES NO NO
title: Mulliken charges:
elementType: Cl Cl F F F O O O O O O N N N N N C C C C C C C C C C C C H H H H
charge: 0.120806 0.039714 -0.152964 -0.144879 -0.142333 -0.170114 -0.130623 -0.168036 -0.201573 -0.183645 -0.215635 -0.438312 -0.009752 0.016573 0.035590 0.032004 0.264672 0.564268 0.269472 0.453845 -0.573685 -0.590369 0.111799 0.272496 0.219992 -0.227726 -0.100603 -0.272073 0.328764 0.416116 0.301662 0.274546
chargesum: 0.00000
title: Mulliken charges with hydrogens summed into heavy atoms:
elementType: Cl Cl F F F O O O O O O N N N N N C C C C C C C C C C C C
charge: 0.120806 0.039714 -0.152964 -0.144879 -0.142333 -0.170114 -0.130623 -0.168036 -0.201573 -0.183645 -0.215635 -0.022196 -0.009752 0.016573 0.035590 0.032004 0.264672 0.564268 0.269472 0.453845 -0.573685 -0.261604 0.111799 0.272496 0.219992 0.073935 0.173943 -0.272073
polarizability: 3.45163095e+02 1.52689569e+00 2.74410879e+02 -2.03666206e+01 -6.63151447e+00 1.32874480e+02
1716.lowfreq: -4.6813 -2.0736 -0.0026 -0.0021 0.0005 4.4672 21.8566 26.9424 38.6383
frequency: 21.8391 26.9333 38.6319 44.1691 58.7953 68.1414 72.8175 81.4162 88.7526 99.8438 118.4644 137.7771 141.3734 183.1621 194.0777 205.1654 218.6697 236.8889 248.5697 262.4249 283.5748 286.5768 302.8837 308.5429 311.3256 360.6438 365.3376 381.4307 400.0207 434.7105 447.9427 474.5322 482.3618 494.1649 525.2717 545.3813 573.1518 587.5526 608.8076 618.9354 646.0598 656.8651 670.2219 672.9262 694.3373 708.0645 713.4944 718.5022 744.0408 757.1103 773.6676 797.3148 811.0780 829.8314 876.7281 911.1114 948.5610 954.2782 980.5500 1010.1329 1025.6278 1031.2502 1075.7487 1128.4612 1138.6371 1147.6868 1184.2031 1198.8539 1206.9428 1228.9058 1242.5270 1284.2318 1329.1786 1348.4124 1356.6096 1367.8765 1379.0514 1395.6113 1403.1491 1434.4867 1464.5480 1487.1531 1541.3053 1560.0374 1580.2860 1612.5542 3182.0122 3187.3928 3190.1859 3203.9827
redmass: 15.1148 17.4536 11.7504 16.6372 20.9043 13.2522 9.5914 15.7178 13.9566 15.9319 11.9615 17.1216 15.5875 15.4399 12.3006 10.6443 19.1206 11.6733 11.1543 8.1249 13.2995 16.7785 7.8928 17.7684 17.7741 8.5701 10.5155 13.0064 8.2762 8.3579 4.8658 12.4883 10.6515 11.2434 9.8462 8.4212 8.8477 9.2955 7.7031 8.8544 6.2133 8.3102 8.7258 8.0088 11.0392 8.5136 7.2874 6.2215 3.5637 8.7099 3.8132 3.7969 9.4850 1.4403 10.9704 8.9553 1.9262 3.0601 1.3462 8.9632 5.4022 11.1935 11.7492 1.8061 2.7457 2.6951 5.8156 7.5405 5.9793 2.9227 3.1945 3.9875 6.1193 5.7267 8.2290 6.7146 10.5528 4.0884 5.8412 5.8184 5.1371 3.2765 8.7382 4.4168 5.7625 8.2452 1.0906 1.0915 1.0787 1.0982
irintensity: 0.1825 0.2110 0.5166 0.2898 0.8164 1.9498 3.8186 0.7196 0.4016 0.6628 3.2604 1.8468 0.6152 4.1624 2.0366 6.3949 0.5501 1.4672 7.0035 4.2355 1.2873 3.9718 0.7649 1.6869 1.9715 2.1731 3.4603 0.5258 1.6224 5.4115 3.0507 14.0568 24.0894 8.2112 0.7327 3.7156 12.7144 3.3204 41.9411 4.4743 12.7314 2.2285 6.5699 5.1439 17.9152 8.3022 3.9234 8.5493 25.0271 1.0576 63.6085 71.3284 9.0983 28.0876 33.4294 35.7179 74.8564 8.6139 1.7274 183.5867 48.2139 90.7203 228.3425 17.3218 33.4903 124.1339 143.2264 378.3065 217.5581 75.9554 212.1039 79.0628 383.2883 40.3851 36.7553 12.8534 50.6215 97.7032 105.7119 187.7737 156.5116 125.2256 107.1229 917.8578 121.3836 130.6029 2.9207 19.7300 168.5958 2.7814
temp: 298.150 k
press: 1.00000 atm
elementType: 17 17 9 9 9 8 8 8 8 8 8 7 7 7 7 7 6 6 6 6 6 6 6 6 6 6 6 6 1 1 1 1
symmnumber: 1
zpe: 443412.9 jmol-1
zpe.correction: 0.168887 hartree
zpe.thermalcorrener: 0.193407 hartree
zpe.thermalcorrenthalpy: 0.194351 hartree
zpe.thermalcorrgfe: 0.112072 hartree
zpe.sumelectzpe: -2402.160941 hartree
zpe.sumelectthermal: -2402.136422 hartree
zpe.sumelectthermalent: -2402.135477 hartree
zpe.sumelectthermalfe: -2402.217756 hartree
dipole: 2.3215 -2.3372 1.4623
dipole: 3.6042
quadrupole: -168.6774 -193.4521 -177.2196
quadrupole: -15.8362 12.6018 -1.7333
quadrupole: 11.1056 -13.6691 2.5635 -15.8362 12.6018 -1.7333
hfenergy: -2402.3298283 hartree
pointgroup: C01 [X(C12H4Cl2F3N5O6)]
dipole: 0.8962157 0.3349736 -1.0465743 debye
polarizability: 343.5419454|19.761096|204.7808389|19.5005165|-70.1842005|204.1256694 unknown
InChI: InChI=1S/C12H4Cl2F3N5O6/c13-7-2-1-5(20(23)24)11(18-7)19-9-6(21(25)26)3-4(12(15,16)17)8(14)10(9)22(27)28/h1-3,19H
charge 0 multiplicity 1
32 atoms
Cl -3.021657 2.374708 -0.901346
Cl 2.294086 1.474488 -3.80499
F  -5.16768 -1.518552 -0.027958
F  -5.268654 0.687168 0.461043
F  -4.908308 0.009408 -1.675557
O  0.653142 2.34588 0.783045
O  -0.13374 2.67837 -1.332516
O  -1.387603 -3.817417 1.165993
O  0.492548 -2.769785 1.914605
O  5.136754 -0.231322 2.037181
O  3.065632 -1.13001 2.365055
N  1.118885 -0.531932 0.655046
N  -0.062372 2.016676 -0.240328
N  -0.647143 -2.772674 1.291683
N  1.838116 0.432362 -1.369346
N  3.93311 -0.471377 1.648919
C  -0.250154 -0.412469 0.415893
C  -0.875796 0.773978 -0.099115
C  -1.133734 -1.501176 0.716434
C  -3.094738 -0.280065 -0.075726
C  -2.265588 0.845661 -0.33864
C  -2.513248 -1.434923 0.461089
C  2.151986 -0.015754 -0.120069
C  -4.586076 -0.267377 -0.32861
C  3.516298 0.003076 0.325231
C  4.515169 0.515401 -0.53739
C  4.168816 0.981025 -1.814085
C  2.797722 0.906879 -2.165377
H  -3.122773 -2.315214 0.679282
H  1.412096 -1.151568 1.44057
H  5.547933 0.540216 -0.180155
H  4.910974 1.381415 -2.50636
