program: Gaussian 09
title: 000183095
version: EM64L-G09RevD.01
frameworkgroup: C1[X(C10H10N4O)]
method: RPBEPBE
basis: SDD
operation: Freq
keyword: #p
keyword: freq=noraman
keyword: PBEPBE/SDD
title: #p freq=noraman PBEPBE/SDD
converged: YES YES NO NO
title: Mulliken charges:
elementType: O N N N N C C C C C C C C C C H H H H H H H H H H
charge: -0.235900 -0.485411 0.101781 -0.059413 -0.603211 0.238503 0.179646 0.195454 -0.089856 -0.203890 -0.534751 0.349452 -0.812801 0.085464 -0.789147 0.255026 0.308144 0.247384 0.236173 0.230152 0.231914 0.246923 0.246912 0.312760 0.348694
chargesum: 0.00000
title: Mulliken charges with hydrogens summed into heavy atoms:
elementType: O N N N N C C C C C C C C C C
charge: -0.235900 -0.177267 0.101781 -0.059413 0.058242 0.238503 0.179646 0.195454 -0.089856 -0.203890 -0.279725 0.349452 -0.099092 0.085464 -0.063398
polarizability: 2.53173557e+02 3.16791111e-01 1.33154529e+02 1.09321850e-02 7.66347900e-02 6.51825119e+01
1716.lowfreq: -10.8807 -0.0007 -0.0006 -0.0004 4.0553 4.9658 23.3444 74.1617 117.2342
frequency: 22.7145 74.1602 117.2207 135.9918 156.0044 164.2419 189.1237 190.4012 213.4830 284.5125 315.9566 374.3903 377.4923 401.5882 415.3331 450.5542 492.9406 527.9235 532.7132 548.0767 601.9832 633.8534 689.2135 706.1983 707.8674 717.2569 774.9227 775.8507 812.3582 877.8057 911.2417 960.0108 987.9372 1009.9704 1023.8348 1034.7080 1046.7342 1086.2519 1120.8830 1177.8989 1220.7339 1257.5736 1298.1906 1314.2993 1334.6286 1396.7073 1400.7997 1402.8579 1433.6795 1452.4441 1466.2984 1468.9180 1474.2455 1481.9307 1572.2412 1577.3715 1605.6102 1623.8324 1649.1792 2968.5403 2984.2746 3039.5295 3061.4273 3095.6312 3103.8649 3213.9530 3574.7391 3593.8221 3722.8334
redmass: 1.0136 4.6535 1.0907 1.2641 3.8891 2.5386 5.3648 3.4454 2.8088 4.5915 3.1042 6.6571 7.4424 5.9728 3.5540 1.1644 1.2632 5.1492 4.2940 5.2895 4.3963 5.0622 8.3024 6.8269 5.1683 7.6609 4.3920 5.1525 1.6351 4.1588 5.0875 2.9395 1.7997 3.6248 2.2116 1.4940 1.4755 2.0613 2.8861 2.6125 3.5418 4.3887 3.8681 2.8650 4.8571 1.7579 2.1958 1.3474 6.6246 1.0435 1.2095 1.1700 1.0541 4.2775 4.9227 2.0476 5.2093 4.0857 3.3722 1.0390 1.0373 1.0978 1.0979 1.0960 1.0983 1.0979 1.0455 1.0806 1.1050
irintensity: 0.0789 8.9499 1.3714 69.9535 0.9433 11.1788 4.6386 7.0975 0.4003 12.9229 0.4497 0.6636 6.3553 1.7014 0.2701 271.1783 83.6565 4.3218 14.1652 4.4206 0.0063 8.1777 3.8761 0.9829 1.1491 6.5683 7.7251 6.5448 26.1643 0.9546 21.1575 3.6232 0.8188 14.2108 29.8192 2.9093 7.1913 6.4753 63.9392 14.9296 8.4755 108.8125 34.6077 27.1331 66.7832 75.8886 35.5790 15.4157 53.8794 14.5211 6.7643 66.4389 16.5175 46.3056 145.1992 45.7067 19.5212 181.4315 543.7843 34.7687 39.0015 21.1747 13.7660 15.2374 14.3515 9.4107 164.5977 24.8615 45.4598
temp: 298.150 k
press: 1.00000 atm
elementType: 8 7 7 7 7 6 6 6 6 6 6 6 6 6 6 1 1 1 1 1 1 1 1 1 1
symmnumber: 1
zpe: 499032.7 jmol-1
zpe.correction: 0.190072 hartree
zpe.thermalcorrener: 0.203613 hartree
zpe.thermalcorrenthalpy: 0.204557 hartree
zpe.thermalcorrgfe: 0.149559 hartree
zpe.sumelectzpe: -680.245442 hartree
zpe.sumelectthermal: -680.231901 hartree
zpe.sumelectthermalent: -680.230956 hartree
zpe.sumelectthermalfe: -680.285954 hartree
dipole: 3.2283 7.2343 -0.0203
dipole: 7.9219
quadrupole: -46.7351 -90.3418 -90.4618
quadrupole: 5.9399 -0.1935 0.0250
quadrupole: 29.1112 -14.4956 -14.6156 5.9399 -0.1935 0.0250
hfenergy: -680.4355131 hartree
pointgroup: C01 [X(C10H10N4O1)]
dipole: 1.2222944 -2.8669433 0.0247232 debye
dipolederiv: -0.9426635 -0.1778125 -0.004042 0.0969212 -0.5201668 0.0018373 -0.0040745 0.0000977 -0.1635564 -0.7968523 -0.1377051 -0.0041265 -0.1014884 -0.5527053 0.0033509 0.0011016 0.001308 -0.2968412 -0.4902835 -0.0387569 -0.0014276 0.0677359 -0.3834752 0.0006603 -0.0018292 0.0005295 -0.1984664 -1.5204223 0.0470705 -0.006726 0.3799028 -0.4608554 0.0017058 -0.0127593 0.0015 -0.3006196 -2.0510065 -0.1523899 -0.0007554 -0.0552415 -0.2141295 -0.0092011 0.0205999 -0.0092444 -0.7397582 0.470583 0.0195913 0.0018397 -0.0021175 0.4074662 0.0012402 0.0025182 0.0134614 -0.0526126 -0.0198943 -0.0948512 0.0007968 0.4475896 -0.3531255 0.0035549 -0.0022081 -0.0002623 0.0300519 0.2882414 -0.0630524 0.0012681 -0.8193267 -0.3598712 -0.0034454 0.0037818 -0.0008403 0.0741198 0.7140375 0.142038 0.0024562 -0.6041252 0.3325176 -0.004189 0.0058506 -0.0001807 0.0847949 1.1512337 -0.00369 0.0068581 0.6696265 0.2887223 0.0031074 0.0040768 -0.0024641 0.0250888 -0.2201695 0.2085114 -0.0001823 0.1586155 -0.144099 0.0015636 -0.0003147 0.0011828 -0.2585689 0.5198176 0.0329572 0.0028083 -0.0210362 0.6302361 -0.002285 0.0027708 -0.0014109 -0.0008465 0.0308776 0.0448496 0.0031949 0.0002899 -0.102678 -0.0006909 0.0023805 -0.0151872 0.0918472 2.3354484 0.155893 0.0084552 -0.3215621 0.9065575 -0.0022085 0.0051214 0.0009294 0.1981745 -0.1278237 0.0036534 -0.0011367 0.1559356 0.0228426 0.0010016 -0.0019469 0.000279 0.0794841 0.0376476 -0.0591499 -0.0008162 -0.1125504 -0.0170109 -0.0000826 0.0002224 -0.0004319 0.1894947 0.1555659 -0.0067556 -0.0005267 0.002018 0.1069663 0.0004286 -0.0019271 0.0000373 0.3483201 -0.084156 -0.1372892 0.0139061 -0.0401071 0.0564379 0.0027208 0.0101618 0.0090221 0.107716 0.0482894 0.0630882 0.0982883 0.0236496 -0.0092883 -0.0394547 0.0798411 -0.1010663 -0.0533937 0.0202725 0.0769992 -0.1151713 0.0261831 0.0001782 0.0334254 -0.0920054 0.0959933 -0.0334418 0.0040116 -0.0446989 -0.0004796 -0.148299 -0.0619502 -0.0001017 -0.0001379 0.0004448 0.1216065 -0.0256333 0.0397181 0.0159527 0.0682837 0.0475971 -0.0968705 0.0974777 -0.1054643 -0.027338 -0.0245957 0.0384799 -0.0161618 0.0665674 0.049083 0.0970273 -0.0980441 0.105379 -0.0301406 0.2593928 -0.0000152 -0.0019131 -0.0633232 0.1278955 0.0046963 -0.0142135 0.006147 0.4058141 0.2680817 0.0433169 -0.002359 0.1258587 0.202855 0.0022087 -0.0064439 0.000241 0.3990714 unknown
polarizability: 253.1235293|-2.3191632|133.1982849|1.0618239|-0.169607|65.1887843 unknown
InChI: InChI=1S/C10H10N4O/c1-4-3-6-5(2)7-8(13-9(6)15-4)14-10(11)12-7/h3,12H,11H2,1-2H3
charge 0 multiplicity 1
25 atoms
O  -2.396835 1.326299 -0.018703
N  2.572353 -0.899226 0.017867
N  -0.00622 1.577351 -0.006475
N  2.454011 1.396827 0.008922
N  4.640952 0.394601 0.021584
C  0.04578 -1.398979 0.006133
C  -1.165134 -0.64904 -0.004599
C  1.195873 -0.58857 0.008931
C  -1.087726 0.787098 -0.009918
C  1.1525 0.861753 0.003077
C  -2.579717 -0.978351 -0.01175
C  -3.283734 0.212197 -0.019519
C  0.099143 -2.912089 0.008982
C  3.265771 0.324299 0.017386
C  -4.736806 0.553007 -0.028947
H  -3.031708 -1.968785 -0.011832
H  2.976303 -1.833396 0.020035
H  -0.910774 -3.347505 0.075255
H  0.568979 -3.302798 -0.914853
H  0.682915 -3.296808 0.867827
H  -5.343968 -0.366988 -0.028838
H  -5.010892 1.154164 0.857661
H  -5.000939 1.147377 -0.92312
H  5.237264 -0.42553 0.047448
H  5.055809 1.322191 0.021248
