program: Gaussian 09
title: 000183137
version: EM64L-G09RevD.01
frameworkgroup: C1[X(C23H26O11)]
method: RPBEPBE
basis: SDD
operation: Freq
keyword: #p
keyword: freq=noraman
keyword: PBEPBE/SDD
title: #p freq=noraman PBEPBE/SDD
converged: YES YES NO NO
title: Mulliken charges:
elementType: O O O O O O O O O O O C C C C C C C C C C C C C C C C C C C C C C C H H H H H H H H H H H H H H H H H H H H H H H H H H
charge: -0.281248 -0.270643 -0.442873 -0.431625 -0.439568 -0.285117 -0.433827 -0.360010 -0.181649 -0.445284 -0.435872 -0.050121 -0.242535 -0.125814 -0.058346 -0.179934 -0.352599 0.089236 0.159607 0.115932 -0.109741 0.083543 0.141589 -0.555160 -0.010393 0.085721 0.315585 -0.805273 -0.869193 0.090951 -0.500501 0.304829 -0.348037 -0.379555 0.202808 0.303417 0.268835 0.215177 0.287837 0.217538 0.232989 0.357893 0.333246 0.257297 0.359444 0.279253 0.252951 0.233865 0.229365 0.251197 0.355584 0.236309 0.276163 0.240256 0.290543 0.369927 0.219625 0.221912 0.361182 0.353311
chargesum: 0.00000
title: Mulliken charges with hydrogens summed into heavy atoms:
elementType: O O O O O O O O O O O C C C C C C C C C C C C C C C C C C C C C C C
charge: -0.281248 -0.270643 -0.084979 -0.098379 -0.080123 -0.285117 -0.078243 0.009916 -0.181649 -0.084102 -0.082561 0.152688 0.060881 0.143022 0.156831 0.107903 0.097927 0.089236 0.159607 0.115932 0.147557 0.083543 0.141589 -0.022956 -0.010393 0.085721 0.315585 -0.090846 -0.116465 0.090951 -0.209958 0.304829 -0.128412 -0.157642
polarizability: 3.86509776e+02 9.25111922e+00 3.33184324e+02 -1.36502803e+00 8.55110843e-01 1.85341575e+02
1716.lowfreq: -10.3637 -4.1254 -0.0009 -0.0005 0.0006 1.6835 6.9497 17.0663 21.3041
frequency: -6.7363 16.8938 21.2458 30.9818 39.7577 49.9403 59.7469 66.3923 75.0450 83.9107 92.3834 101.1469 106.4015 121.0681 131.1669 141.0130 152.3755 160.2050 171.0066 179.8047 191.1693 211.2863 222.4610 234.2473 254.6191 263.9567 277.2846 295.4814 308.1212 314.6534 318.7348 324.3645 336.2559 338.0592 342.5587 351.1005 361.6313 362.5485 376.7279 380.8414 398.1496 403.9267 411.8156 418.0767 427.0898 435.7223 445.4671 452.6345 460.0160 464.6490 466.3918 479.5310 496.0188 511.7616 516.6530 537.0996 556.5198 583.2095 584.9239 620.3472 623.7414 638.9137 652.6898 683.2388 692.8653 723.5214 738.8478 740.3129 772.7240 780.3824 783.4510 801.5899 809.4595 876.9422 880.0475 884.3242 901.3360 908.4112 914.3562 943.4342 951.6074 957.9959 965.0191 971.4771 986.0550 999.5431 1005.2465 1012.8724 1029.0497 1038.6850 1046.4063 1054.5758 1061.8961 1070.9196 1073.0165 1079.5113 1098.1435 1107.5735 1119.3702 1125.7344 1138.0510 1154.8746 1161.9512 1173.3711 1183.4515 1185.1194 1203.2040 1206.3393 1219.2476 1224.1822 1254.0263 1259.4562 1262.6566 1280.1621 1288.4307 1295.5696 1300.3549 1305.0010 1310.2215 1331.4993 1333.7760 1338.9653 1344.3423 1347.1769 1350.9308 1365.4476 1372.4623 1373.2104 1375.8928 1384.0485 1393.6039 1399.8143 1402.5386 1407.2823 1428.5628 1436.3510 1456.9671 1461.8194 1463.9483 1475.8434 1484.2913 1493.1740 1495.8194 1578.8555 1583.5575 1609.2126 1616.2498 1635.6435 2917.6102 2946.7108 2957.3373 2982.0820 2984.4835 2999.5888 3001.8257 3023.1000 3059.0934 3065.9221 3090.6762 3096.8568 3098.3254 3103.0895 3105.1415 3115.4548 3118.7557 3137.9489 3189.0831 3517.2443 3520.6013 3540.3839 3544.0044 3545.8445 3586.5773 3594.9099
redmass: 6.8768 6.6462 6.0267 7.0112 6.3416 6.3549 6.0657 6.2443 6.3090 3.5577 2.9331 1.4003 4.0234 3.5793 4.6715 5.5645 3.2523 5.6574 1.3378 3.3094 5.7314 4.5898 5.0040 6.2796 4.9514 4.8275 5.2873 4.5177 3.1190 2.4505 1.1028 1.1420 1.1746 3.6377 5.0015 3.0745 5.4188 4.8434 1.7078 3.0344 1.6578 2.7111 2.9377 3.5887 3.0959 1.7818 3.4914 6.6895 3.3840 5.0622 1.3578 4.2330 5.2901 4.4255 5.0445 4.5006 4.0108 4.4783 3.7841 4.2370 5.7614 7.0039 7.5417 4.5464 6.2124 4.2832 4.1085 4.4857 4.6193 1.9132 2.8146 5.4027 4.3673 4.4541 3.5769 1.3705 3.9074 1.4746 4.5520 3.8564 4.5562 4.1611 3.3834 2.8269 3.0523 2.3866 3.7037 4.7706 1.9222 1.4610 1.5444 2.5440 3.0986 3.0210 2.5192 4.5134 5.2295 2.0840 2.3321 2.4283 1.5615 1.1966 1.1555 1.3724 1.2758 1.5630 1.4544 1.7372 1.7033 1.2558 1.2070 2.1192 1.5339 1.5295 1.9341 3.9152 1.3302 1.5100 1.2995 1.3851 1.8670 1.3351 1.2346 2.3096 1.2646 1.5006 1.4070 1.4099 3.1968 1.3259 1.2874 2.7148 1.6475 4.6759 1.0972 2.9411 1.0673 3.2867 1.1131 1.1096 1.2665 3.0782 1.0790 8.4876 9.2256 7.1365 8.3430 7.0032 1.0828 1.0834 1.0415 1.0803 1.0420 1.0686 1.0649 1.0984 1.0872 1.0922 1.0858 1.0957 1.0981 1.0902 1.0883 1.0871 1.0986 1.0972 1.0920 1.0659 1.0658 1.0649 1.0656 1.0654 1.0661 1.0663
irintensity: 0.0281 1.0956 0.3485 0.1805 5.1052 1.7694 2.4355 2.7586 0.4103 1.5802 1.0232 1.3945 2.0780 6.8068 8.0192 0.4181 2.8627 1.3115 0.0595 0.3010 5.8074 3.8960 4.3428 6.7212 8.9020 13.9874 8.6031 10.0553 5.4014 26.1794 17.6368 215.3496 41.7121 24.3410 3.3220 4.5185 5.8245 20.1580 29.7287 57.4782 51.2675 59.3392 54.3574 33.2881 80.6539 100.5159 14.9007 0.5611 15.7054 3.3975 168.0860 18.5292 8.6173 3.2451 7.2304 12.0916 8.8811 14.6533 17.8305 4.5248 0.6285 4.4636 4.9073 1.8308 5.3222 14.4929 79.6215 20.8009 17.3938 44.2166 13.8122 21.4473 26.7945 306.8517 27.2183 1.8961 109.9721 20.3018 121.1213 86.4966 104.9923 115.6185 10.1375 60.4046 18.7040 4.6964 92.9550 27.6037 16.8763 4.4028 25.3922 94.2421 16.6824 67.5094 221.7650 24.0750 175.4039 5.6993 29.9158 204.0285 376.3283 22.0183 17.7537 2.7611 15.4344 28.9458 55.4960 34.7106 3.1579 27.7330 30.3323 75.0000 33.8685 47.3758 132.9485 72.2041 5.7031 22.9984 21.5004 30.5248 10.0244 21.0463 7.5397 98.7887 18.3974 9.5157 1.7451 23.2688 33.0421 25.1780 30.2004 50.3771 12.0102 82.8642 19.4938 55.3752 10.9240 20.8213 5.4155 14.1961 11.5511 114.2104 37.8204 156.2828 374.0922 29.9234 171.8660 8.1935 43.7292 53.7361 37.6131 5.4708 26.4885 10.9940 39.1500 20.1615 12.6953 13.8374 3.4541 2.1205 24.4567 9.1932 6.0597 16.0339 18.2192 18.0629 1.2838 8.4832 7.2677 31.4609 15.1978 5.9734 39.3674 31.1678
temp: 298.150 k
press: 1.00000 atm
elementType: 8 8 8 8 8 8 8 8 8 8 8 6 6 6 6 6 6 6 6 6 6 6 6 6 6 6 6 6 6 6 6 6 6 6 1 1 1 1 1 1 1 1 1 1 1 1 1 1 1 1 1 1 1 1 1 1 1 1 1 1
symmnumber: 1
zpe: 1208416.6 jmol-1
zpe.correction: 0.460262 hartree
zpe.thermalcorrener: 0.493433 hartree
zpe.thermalcorrenthalpy: 0.494378 hartree
zpe.thermalcorrgfe: 0.395707 hartree
zpe.sumelectzpe: -1716.900526 hartree
zpe.sumelectthermal: -1716.867355 hartree
zpe.sumelectthermalent: -1716.866410 hartree
zpe.sumelectthermalfe: -1716.965081 hartree
dipole: -1.2048 -3.0210 1.5968
dipole: 3.6232
quadrupole: -141.3970 -208.7147 -205.6473
quadrupole: 17.4125 -12.3943 -0.4942
quadrupole: 43.8560 -23.4617 -20.3943 17.4125 -12.3943 -0.4942
hfenergy: -1717.360788 hartree
pointgroup: C01 [X(C23H26O11)]
dipole: -0.4840454 -1.2984882 0.3340543 debye
polarizability: 386.6791043|9.4890339|323.6042338|-4.9291863|35.58002|194.752337 unknown
InChI: InChI=1S/C23H26O11/c1-8-17(28)16-13(27)6-14(11-5-10(25)3-4-12(11)26)32-22(16)9(2)21(8)34-23-20(31)19(30)18(29)15(7-24)33-23/h3-5,14-15,18-20,23-26,28-31H,6-7H2,1-2H3
charge 0 multiplicity 1
60 atoms
O  3.570939 -0.468209 -1.550539
O  2.764004 0.326567 0.611827
O  5.762403 -0.636997 2.015187
O  5.308306 -3.216882 0.470242
O  5.986307 1.081768 -1.085477
O  -2.009633 -0.073126 0.273149
O  2.880381 -2.678402 -3.141309
O  0.015104 4.37434 0.523394
O  -2.622714 4.061801 -0.037452
O  -5.877205 0.787403 1.661075
O  -4.820002 -3.658425 -1.627525
C  5.621281 -0.760674 0.566626
C  4.672205 -1.915473 0.193234
C  5.133533 0.607474 0.015985
C  4.230138 -1.800116 -1.278602
C  3.685214 0.555038 -0.508647
C  3.228652 -2.867951 -1.732928
C  1.487475 0.962623 0.5144
C  0.343123 0.137316 0.429906
C  -0.913189 0.792782 0.350989
C  -3.336744 0.531449 0.571351
C  -1.055658 2.218476 0.318004
C  1.419549 2.380633 0.601809
C  -3.505266 1.812087 -0.261743
C  0.140851 2.985879 0.478994
C  -2.385957 2.822433 0.029644
C  -4.392504 -0.516969 0.286799
C  0.409525 -1.373493 0.455483
C  2.638547 3.235575 0.903998
C  -5.687853 -0.354687 0.848527
C  -4.141035 -1.631638 -0.536258
C  -5.16278 -2.572806 -0.796901
C  -6.708066 -1.292195 0.59068
C  -6.4492 -2.408994 -0.236049
H  6.612465 -0.954783 0.092561
H  3.797647 -1.89736 0.862876
H  5.239969 1.353427 0.816828
H  5.11817 -1.841837 -1.948691
H  3.417904 1.487136 -1.035843
H  2.331408 -2.837399 -1.084058
H  3.685552 -3.867937 -1.66537
H  5.922135 -1.542478 2.388809
H  6.129441 -3.301927 -0.082912
H  -3.348655 0.796742 1.648516
H  5.67989 0.650689 -1.927064
H  -4.473727 2.287704 -0.037979
H  -3.488517 1.554512 -1.3396
H  0.224753 -1.80369 -0.547484
H  1.394403 -1.713321 0.808895
H  -0.373428 -1.779605 1.118139
H  2.531591 -1.754249 -3.237852
H  2.418199 3.981603 1.6939
H  3.455511 2.612311 1.298026
H  3.028669 3.782027 0.021538
H  -3.147156 -1.783019 -0.962654
H  0.908824 4.801899 0.566866
H  -7.705343 -1.160416 1.028813
H  -7.24557 -3.137224 -0.433982
H  -6.787919 0.804503 2.044448
H  -5.591542 -4.264716 -1.750897
