program: Gaussian 09
title: 000183121
version: EM64L-G09RevD.01
frameworkgroup: C1[X(C14H7Cl2F6N5O4)]
method: RPBEPBE
basis: SDD
operation: Freq
keyword: #p
keyword: freq=noraman
keyword: PBEPBE/SDD
title: #p freq=noraman PBEPBE/SDD
converged: YES YES NO NO
title: Mulliken charges:
elementType: Cl Cl F F F F F F O O O O N N N N N C C C C C C C C C C C C C C H H H H H H H
charge: 0.114371 -0.006175 -0.154222 -0.146395 -0.146494 -0.148733 -0.175210 -0.164995 -0.162714 -0.161533 -0.171451 -0.230768 -0.435020 -0.065900 0.001990 0.021695 -0.372582 0.280294 0.550628 0.243424 0.454855 -0.567264 -0.594597 0.290628 0.175367 0.131231 -0.339674 -0.185953 0.269168 0.233141 -0.627882 0.371876 0.329874 0.293439 0.345441 0.288053 0.218951 0.243133
chargesum: 0.00000
title: Mulliken charges with hydrogens summed into heavy atoms:
elementType: Cl Cl F F F F F F O O O O N N N N N C C C C C C C C C C C C C C
charge: 0.114371 -0.006175 -0.154222 -0.146395 -0.146494 -0.148733 -0.175210 -0.164995 -0.162714 -0.161533 -0.171451 -0.230768 -0.063144 -0.065900 0.001990 0.021695 -0.027141 0.280294 0.550628 0.243424 0.454855 -0.567264 -0.264722 0.290628 0.175367 0.131231 -0.339674 0.107486 0.269168 0.233141 0.122256
polarizability: 3.76932198e+02 -6.56418094e+00 2.92311457e+02 2.22941820e+01 1.14298424e+00 1.48455685e+02
1716.lowfreq: -5.0551 -3.5490 -0.0016 -0.0013 0.0010 2.5200 17.2455 21.8998 23.1951
frequency: 17.2354 21.8887 23.1858 33.3251 41.8357 53.1126 59.2074 85.5319 88.0516 98.1983 109.4858 114.7463 123.4485 130.5606 138.4268 149.9176 166.8268 180.6753 185.3673 200.0594 222.0846 228.6675 249.4751 263.9347 269.3676 281.8920 285.8113 304.9716 314.0740 324.0516 338.0237 376.0753 379.0260 387.0690 396.6331 420.8215 446.0607 447.8532 459.9902 479.7085 488.0150 509.3657 529.6200 539.7978 565.5523 582.1076 598.9305 612.9132 629.8000 643.8842 649.9300 668.6199 676.4136 690.8417 709.5683 710.5669 734.8936 746.3320 751.2378 779.1960 809.0423 813.8741 884.0008 908.2821 922.6962 951.8571 953.3898 978.9333 1006.5105 1015.7932 1022.8860 1029.1457 1072.4768 1078.9660 1125.3642 1138.4897 1159.5456 1166.9069 1203.1275 1212.7420 1225.0255 1256.8501 1293.3282 1312.1780 1338.3144 1349.7367 1368.3653 1384.6642 1402.8106 1422.9355 1425.4347 1463.2678 1469.0617 1474.9885 1479.7135 1495.3364 1515.3353 1565.7607 1575.3960 1609.9936 1620.7479 2995.2222 3083.0255 3117.2770 3182.1673 3186.8852 3202.0157 3575.3614
redmass: 12.4151 10.6907 13.7935 15.2920 17.9379 11.3266 19.6082 9.4895 10.1277 7.3461 1.6826 8.5769 2.4860 17.2871 14.7891 10.1139 3.5252 4.2671 11.0964 12.5413 13.7184 15.9592 9.8139 7.1623 9.4229 13.9548 15.9182 10.4320 15.3992 8.4281 11.0181 10.0940 9.0789 11.4167 10.7484 8.4235 7.3803 5.7540 6.4486 8.9636 1.4443 12.2172 9.1013 10.6640 9.3912 9.5854 9.2327 12.2142 8.6783 8.6957 6.9205 8.1488 9.0547 8.7308 8.8390 11.7762 5.1336 9.6018 8.5411 4.4926 12.3470 1.8667 8.5628 1.5243 8.8785 1.4912 5.4977 8.3938 8.1511 4.7927 6.2406 10.7925 11.4262 5.0223 1.2844 3.0023 1.8903 5.9115 7.3636 3.9321 2.3755 3.0429 3.6122 3.7515 11.0754 5.4612 5.1866 10.3323 9.0169 4.7854 1.5811 1.0927 2.1587 2.0588 6.3334 1.2594 3.3840 2.7404 3.1171 5.2271 7.4907 1.0349 1.1002 1.1017 1.0934 1.0917 1.0782 1.0783
irintensity: 0.0740 0.5940 0.1559 0.2723 0.0959 1.1271 0.8270 0.8206 1.4813 0.7575 1.0448 0.5831 1.6787 0.1905 2.1704 3.0620 1.8614 1.0585 2.6763 1.3749 6.1350 0.1694 1.9711 1.5569 2.9313 12.7730 0.7753 2.2214 1.1970 7.5652 7.6217 0.8823 0.5505 1.3467 9.3858 14.9635 4.3997 6.0443 4.8958 10.7995 48.0953 3.5859 1.7124 5.0751 7.0655 4.0216 31.4564 42.3662 5.2602 17.1246 11.4854 10.0794 0.4064 20.1719 8.1430 1.3428 8.5395 7.2979 13.3047 79.1175 18.1931 67.3353 9.0322 97.3892 14.1337 53.1840 199.2965 263.4629 181.0939 19.0736 130.4463 96.3595 245.3257 28.6612 2.4623 54.6721 39.1786 396.4973 128.9484 523.3877 35.6607 52.9089 111.2524 180.2256 388.2678 5.4562 66.1047 66.4228 22.3640 74.0892 102.7843 15.8408 139.5217 41.1526 110.5315 12.5958 84.5465 652.9229 306.1299 80.2299 298.7352 36.6794 13.4815 17.1096 2.6562 18.6843 152.1913 115.7151
temp: 298.150 k
press: 1.00000 atm
elementType: 17 17 9 9 9 9 9 9 8 8 8 8 7 7 7 7 7 6 6 6 6 6 6 6 6 6 6 6 6 6 6 1 1 1 1 1 1 1
symmnumber: 1
zpe: 565591.4 jmol-1
zpe.correction: 0.215422 hartree
zpe.thermalcorrener: 0.244343 hartree
zpe.thermalcorrenthalpy: 0.245287 hartree
zpe.thermalcorrgfe: 0.152715 hartree
zpe.sumelectzpe: -2629.112787 hartree
zpe.sumelectthermal: -2629.083866 hartree
zpe.sumelectthermalent: -2629.082922 hartree
zpe.sumelectthermalfe: -2629.175495 hartree
dipole: 0.9709 -1.4305 -1.3027
dipole: 2.1647
quadrupole: -211.2802 -196.3698 -193.6520
quadrupole: 0.3338 -5.2911 10.2442
quadrupole: -10.8462 4.0642 6.7820 0.3338 -5.2911 10.2442
hfenergy: -2629.3282093 hartree
pointgroup: C01 [X(C14H7Cl2F6N5O4)]
dipole: 0.4062964 -0.0373642 -0.7475622 debye
polarizability: 371.0309035|-36.5479537|218.1705947|21.2275145|69.2801814|228.4978417 unknown
InChI: InChI=1S/C14H7Cl2F6N5O4/c1-23-11-5(14(20,21)22)2-6(15)12(25-11)24-9-7(26(28)29)3-4(13(17,18)19)8(16)10(9)27(30)31/h2-3,23-24H,1H3
charge 0 multiplicity 1
38 atoms
Cl -3.18012 -2.281494 -1.247194
Cl 2.468315 1.102156 3.359827
F  -5.769776 1.402591 -0.812377
F  -4.996132 -0.023949 -2.389369
F  -5.81589 -0.82583 -0.430615
F  6.345671 -0.683223 0.227686
F  5.35133 -1.983237 -1.354603
F  5.732057 0.203541 -1.772058
O  -0.01262 -2.030548 1.304921
O  -0.293068 -2.429565 -0.920213
O  -2.711266 3.829916 1.528654
O  -0.770029 3.008123 2.385519
N  0.243231 0.881798 1.265455
N  1.575399 -0.039061 -0.466404
N  -0.504065 -1.750687 0.146744
N  -1.837431 2.892762 1.63635
N  2.802566 -0.860509 -2.278959
C  -1.015179 0.643514 0.755092
C  -1.409899 -0.570784 0.082772
C  -2.052283 1.635703 0.903776
C  -3.657109 0.315516 -0.383884
C  -2.693563 -0.729777 -0.479413
C  -3.324646 1.471067 0.331095
C  1.487122 0.404409 0.80881
C  3.981308 -0.349964 -0.170815
C  2.782831 -0.429998 -0.980484
C  2.621448 0.498184 1.656527
C  3.872903 0.115465 1.151972
C  -5.034111 0.210371 -0.995072
C  5.319467 -0.690394 -0.731537
C  1.611219 -0.870636 -3.142258
H  0.257023 1.635997 1.983607
H  -4.049607 2.280269 0.44724
H  4.762729 0.180329 1.783404
H  3.677705 -1.223739 -2.656295
H  0.810511 -1.488783 -2.704304
H  1.8958 -1.285001 -4.122532
H  1.220557 0.152967 -3.284667
