program: Gaussian 09
title: 000183102
version: EM64L-G09RevD.01
frameworkgroup: C1[X(C15H20O3)]
method: RPBEPBE
basis: SDD
operation: Freq
keyword: #pfreq=noraman
keyword: PBEPBE/SDD
title: #p freq=noraman PBEPBE/SDD
converged: NO YES NO NO
title: Mulliken charges:
elementType: O O O C C C C C C C C C C C C C C C H H H H H H H H H H H H H H H H H H H H
charge: -0.244267 -0.220015 -0.194755 -0.306253 -0.076935 -0.118237 -0.218585 -0.031735 -0.489729 -0.427500 -0.249561 0.448078 0.102936 0.155473 -0.511819 -0.765058 -0.714354 -0.820284 0.252461 0.254166 0.236116 0.245566 0.181749 0.219241 0.198883 0.196200 0.239034 0.261674 0.277289 0.203927 0.208389 0.269595 0.247694 0.221620 0.218411 0.230044 0.237146 0.283393
chargesum: 0.00000
title: Mulliken charges with hydrogens summed into heavy atoms:
elementType: O O O C C C C C C C C C C C C C C C
charge: -0.244267 -0.220015 -0.194755 -0.053792 0.177232 0.117879 0.026981 0.150014 -0.071605 0.007734 0.012113 0.448078 0.102936 0.155473 -0.234530 -0.083147 -0.026629 -0.069700
polarizability: 1.95802695e+02 1.36531164e+01 1.51604879e+02 -4.71659375e+00 -1.37593526e+00 1.33651855e+02
1716.lowfreq: -7.3856 -0.0004 0.0002 0.0004 13.5426 15.9414 34.1989 54.2888 78.6645
frequency: 33.9598 54.2727 78.6197 108.6913 115.8457 163.7595 174.9991 181.2798 193.7585 213.9895 219.8541 237.6853 258.5934 268.2877 279.9440 299.7684 321.3527 358.4474 414.4590 430.8256 461.9682 473.2012 487.6054 493.9589 568.4500 576.8401 626.6990 634.2397 673.7500 692.9650 714.3505 748.0555 794.0667 809.7957 827.3781 858.9429 878.3334 912.5860 924.3703 933.6604 940.0522 988.4154 1000.1216 1013.9386 1019.8340 1033.1413 1041.8789 1062.0812 1070.1612 1083.1072 1109.4688 1126.3250 1133.1045 1141.5606 1149.7315 1154.7533 1172.1355 1190.0687 1216.5338 1221.1431 1241.0707 1253.7666 1269.7170 1278.3405 1291.0431 1294.5472 1306.1628 1311.7761 1325.1928 1329.7276 1337.2991 1353.7317 1364.5802 1372.9802 1388.5319 1394.8953 1401.0036 1445.4655 1459.8811 1464.9033 1472.1730 1473.0817 1476.6868 1477.1090 1492.7815 1616.2615 1625.7039 1699.5487 2940.1515 2951.8149 2953.9753 2959.2026 2976.3238 2979.3512 2983.2819 2986.6329 2989.9122 2991.0257 3002.7616 3018.8933 3046.6489 3058.9645 3065.5875 3087.0759 3095.4236 3097.5221 3098.9063 3177.8670
redmass: 5.4543 3.6602 5.1179 1.2415 3.4296 3.6463 2.5339 3.5655 1.1286 2.5148 1.9900 1.8243 5.1588 3.4344 2.4142 3.4666 2.4283 4.0719 3.2803 3.2740 3.9166 3.6171 3.0387 3.7355 5.6938 4.0972 4.0134 4.3140 4.1073 3.8804 3.9338 3.1580 3.3932 2.4811 2.2732 1.7858 1.6426 1.9047 2.5654 1.7548 4.5151 1.7212 1.6321 2.4047 1.9249 2.1380 1.8291 2.4882 2.1836 2.1161 1.6947 1.9810 2.6851 2.0528 2.2926 1.6902 2.1125 2.0385 1.5422 1.4169 1.5171 1.3131 1.4136 1.3113 1.8865 1.5229 1.3542 1.3862 1.4217 1.4646 1.5154 1.5232 1.4802 1.5206 1.2042 1.2008 1.2422 1.0506 1.0863 1.0845 1.0501 1.0463 1.0528 1.0758 1.0576 9.7752 6.4404 12.3630 1.0822 1.0686 1.0754 1.0818 1.0374 1.0424 1.0753 1.0712 1.0705 1.0453 1.0867 1.0972 1.1000 1.0913 1.0987 1.1004 1.0995 1.0999 1.1009 1.0975
irintensity: 3.7059 3.2801 2.9302 0.1371 0.0947 3.3879 0.1534 1.0376 0.2355 3.1445 2.9729 1.4139 2.5987 0.8561 2.5267 1.7956 0.5136 1.8537 6.7189 1.0575 2.3520 6.5857 1.6919 2.6750 1.5855 4.2000 1.0254 9.1996 8.3638 3.6111 4.5518 3.4240 10.8613 1.4881 4.6166 4.9509 35.0785 5.6473 2.6868 27.9346 118.7808 15.5040 17.7854 53.2223 10.6458 18.6325 3.5869 1.9585 13.5381 27.4806 5.6836 69.7400 22.0026 23.8771 8.3781 1.6375 8.7837 30.6255 0.1450 10.0500 4.2106 2.6672 13.0373 9.1880 20.4120 19.6287 2.5809 6.1699 1.0012 2.4688 2.6922 2.0780 1.2116 6.9566 26.9099 18.4370 35.6168 12.7001 33.9349 4.8256 6.6912 21.3936 5.4489 20.4772 14.8926 270.9227 22.8924 317.1238 27.8876 12.6853 24.2188 7.2908 40.3522 5.6051 28.5794 7.9048 41.5176 12.1142 34.7360 42.3245 32.6994 10.0437 46.6140 26.7949 12.9295 16.3518 14.2569 4.6387
temp: 298.150 k
press: 1.00000 atm
elementType: 8 8 8 6 6 6 6 6 6 6 6 6 6 6 6 6 6 6 1 1 1 1 1 1 1 1 1 1 1 1 1 1 1 1 1 1 1 1
symmnumber: 1
zpe: 837663.8 jmol-1
zpe.correction: 0.319049 hartree
zpe.thermalcorrener: 0.336157 hartree
zpe.thermalcorrenthalpy: 0.337101 hartree
zpe.thermalcorrgfe: 0.275033 hartree
zpe.sumelectzpe: -807.905344 hartree
zpe.sumelectthermal: -807.888237 hartree
zpe.sumelectthermalent: -807.887293 hartree
zpe.sumelectthermalfe: -807.949361 hartree
dipole: -0.8777 -1.4598 -1.1414
dipole: 2.0504
quadrupole: -138.3374 -97.6934 -108.7183
quadrupole: -4.0101 14.4048 0.6259
quadrupole: -23.4210 17.2230 6.1980 -4.0101 14.4048 0.6259
hfenergy: -808.2243937 hartree
pointgroup: C01 [X(C15H20O3)]
dipole: -0.2612893 0.6341894 0.4245802 debye
polarizability: 192.6016037|-18.0309192|154.885071|3.0722164|-2.3556663|133.5727544 unknown
InChI: InChI=1S/C15H20O3/c1-7-4-5-10-9(3)15(17)18-14(10)13-8(2)6-11(16)12(7)13/h6-7,9-10,12-14H,4-5H2,1-3H3
charge 0 multiplicity 1
38 atoms
O  1.99825 -0.649061 1.099602
O  -3.192708 -0.328417 -1.486442
O  4.1584 -0.619917 0.254184
C  -0.469272 -0.864639 0.943726
C  0.930639 0.9299 -0.418794
C  0.725068 0.121933 0.890033
C  -1.844563 -0.167444 0.630422
C  -1.984393 1.383231 0.768879
C  0.189972 2.28335 -0.402762
C  -1.352583 2.189673 -0.403067
C  2.474333 1.075218 -0.513493
C  -0.392147 -2.014997 -0.073968
C  -2.252049 -0.747768 -0.752988
C  3.021085 -0.123191 0.273645
C  -1.373767 -1.901786 -1.024198
C  -3.481204 1.759053 0.92076
C  3.056602 1.161726 -1.935835
C  0.607998 -3.129559 0.037446
H  -0.469567 -1.287518 1.968464
H  0.579368 0.324536 -1.278728
H  0.648167 0.813633 1.751649
H  -2.575741 -0.60742 1.342374
H  -1.471775 1.681452 1.710202
H  0.507236 2.870907 -1.287491
H  0.524839 2.855102 0.489342
H  -1.750989 3.222381 -0.355586
H  -1.712176 1.76984 -1.361586
H  2.78267 1.979529 0.055623
H  -1.534692 -2.576824 -1.868481
H  -3.944107 1.227958 1.77422
H  -3.594443 2.844708 1.096479
H  -4.037731 1.488858 0.007274
H  4.159301 1.182728 -1.901098
H  2.752173 0.288353 -2.54013
H  2.703804 2.075212 -2.446449
H  0.462095 -3.889324 -0.748408
H  0.51958 -3.623354 1.025144
H  1.644124 -2.751063 -0.006163
