program: Gaussian 09
title: 000183099
version: EM64L-G09RevD.01
frameworkgroup: C1[X(C19H20N2O)]
method: RPBEPBE
basis: SDD
operation: Freq
keyword: #p
keyword: freq=noraman
keyword: PBEPBE/SDD
title: #p freq=noraman PBEPBE/SDD
converged: YES YES NO NO
title: Mulliken charges:
elementType: O N N C C C C C C C C C C C C C C C C C C C H H H H H H H H H H H H H H H H H H H H
charge: -0.306120 -0.179568 -0.086355 -0.021913 -0.437211 0.262144 -0.685298 -0.706845 0.378577 -0.257486 -0.461878 -0.371341 -0.398439 -0.400805 -0.363703 0.329148 0.347627 -0.364138 -0.384615 -0.203615 -0.193399 -0.250629 0.199583 0.223747 0.240942 0.213255 0.229389 0.218273 0.222200 0.204911 0.240184 0.263086 0.264949 0.246409 0.249314 0.258341 0.267868 0.264608 0.258105 0.228799 0.230817 0.231083
chargesum: 0.00000
title: Mulliken charges with hydrogens summed into heavy atoms:
elementType: O N N C C C C C C C C C C C C C C C C C C C
charge: -0.306120 -0.179568 -0.086355 0.177670 0.027478 0.262144 -0.024381 -0.039550 0.378577 0.005600 -0.196930 -0.124932 -0.149125 -0.142464 -0.095834 0.329148 0.347627 -0.099530 -0.126510 0.025183 0.037418 -0.019545
polarizability: 3.48098765e+02 -9.51885353e+00 1.74085798e+02 5.61076003e+00 -5.42695610e+00 1.67628420e+02
1716.lowfreq: -8.6418 -0.0006 -0.0005 -0.0004 2.0644 5.5669 16.5093 18.9832 35.5736
frequency: 15.0664 18.6022 35.5311 43.7475 51.8348 85.7835 95.9009 100.2764 119.7408 175.4496 202.6554 226.6972 242.0896 251.3941 255.8522 275.4207 338.4104 361.8560 373.2597 377.1220 401.4203 411.0236 417.5387 447.9008 481.8908 498.5331 546.5969 587.9858 604.4516 622.1822 639.2495 653.5477 675.2717 692.8975 709.4249 728.1558 747.8065 769.4548 778.6778 790.7668 820.6488 829.6978 838.7297 846.1369 853.3506 879.5346 896.1970 907.7603 923.6952 953.8230 959.1438 963.2441 966.0763 972.2723 986.5704 987.8419 996.0264 1018.2046 1019.7275 1077.1898 1091.3001 1092.7259 1110.7647 1113.2709 1152.2732 1169.3785 1173.6680 1179.5814 1189.6061 1200.3396 1211.7421 1221.4807 1233.3823 1281.7537 1293.2330 1296.8210 1308.0620 1316.3108 1338.8454 1353.5737 1360.7827 1368.3645 1379.0694 1384.1876 1398.3852 1412.4051 1426.8247 1442.2582 1462.2054 1469.1120 1470.8990 1475.0517 1476.5858 1482.9498 1491.5823 1545.0444 1575.6013 1595.3771 1605.3442 1622.0275 2961.5878 2972.8733 2979.1056 3008.7044 3067.1716 3073.4318 3077.0631 3079.3510 3082.6648 3131.4735 3135.0725 3140.3515 3141.0200 3156.1791 3164.2440 3165.6836 3169.2370 3175.2251 3223.6844 3234.4429
redmass: 2.9402 4.7832 3.9063 4.7825 4.5590 3.4826 4.0679 4.2071 5.3100 3.5916 4.5662 1.1571 4.2080 2.2338 1.4266 4.4152 4.6426 2.6043 3.5624 2.3275 5.0064 2.9350 3.0220 3.6128 3.4296 2.9406 3.1393 5.4073 5.9212 6.3707 6.1312 3.9378 4.1130 2.2349 3.5419 3.6635 2.8029 2.2368 1.4311 2.9441 1.4298 1.2895 1.2892 1.6061 5.2503 2.7834 1.9611 1.4206 1.2619 1.3925 1.8266 1.6424 1.3714 1.3528 4.7778 1.3890 4.7865 2.5658 2.1037 1.5011 1.5254 2.0628 1.5039 1.9564 2.0961 1.1039 1.1595 2.1767 1.4370 1.9045 1.6426 3.3904 2.0030 2.7644 1.7164 1.2952 1.3621 1.7162 3.7383 1.7700 3.3539 1.5479 1.2475 8.8721 1.2300 3.8968 2.7775 2.2993 1.0465 2.1816 1.2140 1.8455 1.2067 1.0769 1.0582 5.6847 7.4143 6.4264 6.5774 6.5791 1.0817 1.0363 1.0360 1.0644 1.0994 1.1000 1.0997 1.0993 1.0992 1.0850 1.0892 1.0888 1.0889 1.0931 1.0960 1.0961 1.0961 1.1003 1.0964 1.0996
irintensity: 0.1037 0.1036 0.8107 0.7973 2.6347 0.3742 2.0488 0.8203 0.6262 0.3484 0.3605 0.0749 0.4853 1.9704 0.4370 0.1877 3.0354 0.2169 1.0182 5.0989 1.3451 0.8338 0.9612 2.9278 16.4422 11.8632 15.7893 4.1327 1.9583 1.7901 2.5133 15.2741 5.2090 31.1209 7.8515 7.6999 31.3019 58.9318 26.8431 4.1394 41.0249 2.5011 6.3391 51.3702 47.9120 6.0457 17.2177 5.3498 0.8196 0.8237 2.8932 2.2615 0.3997 0.1010 1.2142 0.9718 11.9608 1.0580 13.7732 11.0634 18.1678 4.7002 13.6759 25.7384 4.1802 12.5200 58.0151 2.5120 24.8491 11.2104 28.7820 522.6385 13.1334 18.4423 0.4091 2.8739 0.9633 1.8653 10.6256 12.6886 5.2941 0.9992 21.1494 1.4685 14.5942 5.0354 30.5199 1.2776 1.7760 271.4503 40.3237 18.9897 7.3669 31.6964 24.5181 94.3379 10.1032 34.1629 76.0838 3.8282 23.1407 35.1507 14.3164 44.3500 27.0489 1.1318 38.6507 69.3120 31.7793 2.7588 13.6343 5.8431 18.1989 30.5996 4.4614 15.4186 1.9861 8.9353 5.6705 0.6851
temp: 298.150 k
press: 1.00000 atm
elementType: 8 7 7 6 6 6 6 6 6 6 6 6 6 6 6 6 6 6 6 6 6 6 1 1 1 1 1 1 1 1 1 1 1 1 1 1 1 1 1 1 1 1
symmnumber: 1
zpe: 899939.1 jmol-1
zpe.correction: 0.342769 hartree
zpe.thermalcorrener: 0.362663 hartree
zpe.thermalcorrenthalpy: 0.363607 hartree
zpe.thermalcorrgfe: 0.291421 hartree
zpe.sumelectzpe: -919.160766 hartree
zpe.sumelectthermal: -919.140872 hartree
zpe.sumelectthermalent: -919.139928 hartree
zpe.sumelectthermalfe: -919.212114 hartree
dipole: -1.8246 3.7499 1.8085
dipole: 4.5455
quadrupole: -127.5399 -132.2990 -129.6646
quadrupole: 14.1216 19.8139 -5.0239
quadrupole: 2.2946 -2.4645 0.1698 14.1216 19.8139 -5.0239
hfenergy: -919.5035347 hartree
pointgroup: C01 [X(C19H20N2O1)]
dipole: 0.8500062 -1.2843347 0.9089065 debye
polarizability: 348.3897333|5.896337|175.0995434|-6.4667421|3.8067017|166.3237071 unknown
InChI: InChI=1S/C19H20N2O/c1-15(2)13-21-14-20-12-19(21)16-8-10-18(11-9-16)22-17-6-4-3-5-7-17/h3-12,14-15H,13H2,1-2H3
charge 0 multiplicity 1
42 atoms
O  2.954727 1.142009 0.86378
N  -3.600832 0.015174 0.15466
N  -4.60197 1.030439 -1.621765
C  -3.407599 -2.42135 0.915563
C  -3.462022 -0.911852 1.298339
C  -2.572892 0.671118 -0.567066
C  -2.224353 -2.737543 -0.027466
C  -4.742106 -2.940294 0.332296
C  -1.150639 0.730745 -0.18189
C  -4.791957 0.266426 -0.527697
C  -3.22447 1.277501 -1.653405
C  -0.730806 1.092553 1.130154
C  -0.14568 0.492717 -1.159552
C  0.635054 1.186004 1.459205
C  1.225373 0.599214 -0.849709
C  1.611459 0.933945 0.46955
C  4.024783 0.447249 0.240896
C  3.941095 -0.916727 -0.125049
C  5.23058 1.168024 0.100236
C  5.085886 -1.554647 -0.652802
C  6.367658 0.51522 -0.424305
C  6.300134 -0.845299 -0.807252
H  -3.231481 -2.945649 1.879614
H  -4.316673 -0.737149 1.979154
H  -2.540409 -0.651005 1.844058
H  -2.157695 -3.825449 -0.210993
H  -2.355699 -2.23735 -1.004414
H  -1.261476 -2.400215 0.398185
H  -4.696703 -4.034575 0.183571
H  -5.593377 -2.726282 1.006475
H  -4.955044 -2.479345 -0.64931
H  -5.75187 -0.114848 -0.187508
H  -2.781872 1.91242 -2.418156
H  -1.479077 1.349001 1.88862
H  -0.448197 0.219406 -2.176257
H  0.961001 1.474527 2.462802
H  1.980393 0.428969 -1.62311
H  3.007174 -1.471036 0.010943
H  5.259409 2.218672 0.404013
H  5.028009 -2.611701 -0.935305
H  7.304829 1.071461 -0.535562
H  7.183138 -1.347577 -1.216042
