program: Gaussian 09
title: 000183082
version: EM64L-G09RevD.01
frameworkgroup: C1[X(C9H14O2)]
method: RPBEPBE
basis: SDD
operation: Freq
keyword: #pfreq=noraman
keyword: PBEPBE/SDD
title: #p freq=noraman PBEPBE/SDD
converged: YES YES NO NO
title: Mulliken charges:
elementType: O O C C C C C C C C C H H H H H H H H H H H H H H
charge: -0.211684 -0.225472 -0.069239 -0.104833 -0.447181 -0.434787 -0.394950 -0.414312 -0.576368 -0.367645 0.201966 0.216538 0.226984 0.208793 0.216756 0.202021 0.207852 0.193322 0.209211 0.202989 0.209286 0.248594 0.250135 0.222903 0.229122
chargesum: 0.00000
title: Mulliken charges with hydrogens summed into heavy atoms:
elementType: O O C C C C C C C C C
charge: -0.211684 -0.225472 0.147299 0.122151 -0.021632 -0.024914 0.007583 -0.002037 -0.077638 0.084380 0.201966
polarizability: 1.13813374e+02 -7.39041966e+00 9.28134314e+01 -2.95138522e-01 -1.03477089e+00 8.02340862e+01
1716.lowfreq: -9.3048 -0.0005 -0.0003 0.0007 26.0042 28.1358 62.6655 102.7644 175.6636
frequency: 61.4328 102.7538 175.6604 178.7339 289.8619 300.6456 330.3493 342.2970 420.4006 457.4455 464.4469 525.2425 577.0700 585.2054 690.0227 711.4403 778.1936 813.5226 843.3282 847.8446 908.7256 919.8027 945.4920 955.5602 1001.8533 1004.2624 1047.3686 1057.7117 1074.6937 1112.4443 1128.4814 1139.0958 1143.8388 1179.0166 1206.7604 1239.1704 1251.3221 1259.1136 1282.4086 1295.0528 1318.6733 1333.2004 1338.6704 1342.4854 1346.8218 1351.8610 1373.2473 1380.4200 1440.9241 1463.5589 1468.9908 1471.2437 1479.4022 1492.3693 1656.1099 2959.3655 2967.1848 2967.3234 2973.4987 2976.6077 2982.8660 2988.4283 3017.6481 3024.5709 3029.5725 3033.8550 3045.3452 3060.4512 3082.8560
redmass: 4.3691 5.7181 2.2319 2.6686 2.2660 2.2749 2.4246 2.7252 4.7060 3.0888 2.9230 3.1331 3.6136 2.3314 4.0649 4.3015 2.1234 1.6217 2.4930 2.2729 1.8491 2.1176 2.1265 2.2397 2.6168 2.0564 2.0005 1.8628 1.4382 1.3742 2.0213 1.8178 3.0385 1.4511 1.2673 1.3050 1.3175 1.3360 1.2574 1.6002 1.3122 1.4865 1.4747 1.4378 1.4945 1.3838 1.4851 1.4133 1.0793 1.0860 1.0886 1.0847 1.0875 1.0876 11.8649 1.0790 1.0666 1.0645 1.0638 1.0653 1.0714 1.0735 1.0609 1.0990 1.0968 1.0995 1.1023 1.0949 1.1063
irintensity: 6.5471 1.8734 2.1159 0.7495 0.9561 1.3003 1.5116 0.3647 2.1041 1.2359 1.5149 2.7482 5.2715 1.8720 5.7196 3.4914 9.6257 6.5600 6.8842 1.5628 8.5926 2.0363 13.7958 19.6956 34.3230 3.9506 104.4799 15.7026 0.9630 0.9742 1.9690 2.2111 109.9031 24.8245 16.7537 3.3605 4.2016 0.4150 2.8454 9.0288 0.7369 1.6022 1.1092 1.5745 0.3638 3.9263 0.6563 1.7547 15.0929 4.8639 9.5662 12.7552 8.3663 14.0537 316.9672 16.0323 14.0548 29.3319 39.1670 26.5684 29.1245 48.3114 33.4797 58.1307 36.0686 28.9173 105.4889 12.4167 29.4999
temp: 298.150 k
press: 1.00000 atm
elementType: 8 8 6 6 6 6 6 6 6 6 6 1 1 1 1 1 1 1 1 1 1 1 1 1 1
symmnumber: 1
zpe: 568319.6 jmol-1
zpe.correction: 0.216462 hartree
zpe.thermalcorrener: 0.226148 hartree
zpe.thermalcorrenthalpy: 0.227092 hartree
zpe.thermalcorrgfe: 0.181538 hartree
zpe.sumelectzpe: -500.943407 hartree
zpe.sumelectthermal: -500.933720 hartree
zpe.sumelectthermalent: -500.932776 hartree
zpe.sumelectthermalfe: -500.978331 hartree
dipole: -5.6454 -0.2013 1.8810
dipole: 5.9539
quadrupole: -85.3566 -64.3363 -64.7468
quadrupole: -1.3606 5.4310 0.0347
quadrupole: -13.8767 7.1436 6.7331 -1.3606 5.4310 0.0347
hfenergy: -501.1598686 hartree
pointgroup: C01 [X(C9H14O2)]
dipole: -2.2347569 -0.0343785 0.7012174 debye
dipolederiv: -0.8672522 0.2617294 0.0098309 0.7068252 -0.904129 0.1846282 -0.1317396 0.2358317 -0.4058889 -1.1869045 0.2758995 0.1002423 0.2128191 -0.5503189 0.0595606 0.2116541 0.0231647 -0.4216863 0.0597093 0.0425757 -0.0258447 0.0219465 0.072389 -0.0018041 0.0217743 -0.0137554 0.1278621 -0.0998388 0.0646533 0.0159605 0.0259568 0.0286899 0.0515419 -0.0007527 0.057842 0.0750705 0.0049007 0.013351 -0.0398788 0.0321106 0.0716706 -0.0527862 -0.0573786 -0.0150928 0.0853225 0.1164157 -0.0180235 -0.0369851 -0.0163124 0.0939942 -0.020811 0.0175726 -0.0223447 0.0982667 0.080416 0.0315908 -0.0173508 0.0155195 0.0621764 -0.0145467 -0.0541427 -0.0345423 0.1330257 0.050381 0.0214237 -0.044215 0.0204959 0.0474969 -0.0261751 -0.0193634 -0.0331727 0.1060425 -0.0683949 -0.0532285 0.0909816 -0.0273064 -0.0479685 0.1216693 0.1476849 0.1657916 -0.0646114 0.6580834 -0.1675826 0.0669015 -0.0861307 0.3225636 0.0158351 -0.0512126 0.047698 0.2714461 1.4492661 -0.412634 -0.2192433 -0.7639811 1.1610957 -0.3427311 -0.1537838 -0.4095094 0.5210279 -0.0220801 -0.0655726 0.1110641 -0.0577528 0.0040824 0.0570106 0.0836091 0.0598765 -0.113556 0.0033143 -0.0583886 -0.0865777 -0.0553225 -0.0119567 -0.0662766 -0.0669585 -0.082933 -0.12342 0.0275017 0.0709792 -0.0110229 0.0532564 -0.1856466 -0.0063193 -0.0143168 0.0315333 0.0653833 -0.0250726 -0.0317041 0.0719968 -0.0486396 0.0611262 0.0820996 0.0863961 0.036646 -0.0984047 0.0346163 0.0232791 -0.0168436 0.0675047 -0.2125473 -0.0161707 -0.0382512 0.0220082 0.0666106 -0.0402742 -0.0158999 0.0666542 -0.0670192 0.066771 0.0835701 0.0833427 0.0200582 -0.1275086 -0.0016296 -0.0159192 0.0637638 -0.0101729 0.0096638 0.0639509 0.1275433 0.1158803 -0.0991417 -0.0176419 -0.0526302 -0.0843977 -0.0573609 -0.0228283 -0.0980041 -0.1226305 -0.1259841 -0.0763617 0.0781957 -0.0527052 0.1007112 -0.0259057 -0.0101328 0.0544436 0.0578544 0.0664672 -0.1341742 -0.2250919 0.0575272 -0.0316069 0.0383691 0.0404533 -0.0068697 -0.0013819 -0.0096442 0.073749 0.0356026 0.0373378 0.0224364 0.0584324 -0.0907032 0.0045219 0.0255816 -0.0444927 0.1045258 0.0072788 -0.0355954 -0.0287062 -0.0560825 0.0779172 -0.0686516 -0.068425 -0.0296664 -0.0609372 -0.0559285 0.0593975 -0.0742022 -0.0047821 0.0677219 -0.0779482 -0.088654 -0.0333046 -0.0878134 0.0044278 0.0201396 -0.0036683 0.0235325 -0.1515809 0.0202624 0.0059782 -0.0283555 0.0851713 unknown
polarizability: 113.7372754|-7.4525256|92.7481673|0.6778285|-1.7714012|80.3754485 unknown
InChI: InChI=1S/C9H14O2/c10-9-5-7-3-1-2-4-8(7)6-11-9/h7-8H,1-6H2
charge 0 multiplicity 1
25 atoms
O  1.700659 1.104539 -0.553366
O  3.360134 -0.436104 -0.335246
C  -0.21996 -0.695778 0.765859
C  -0.508067 0.828792 0.697462
C  -0.852852 -1.452015 -0.430375
C  -2.032675 1.103759 0.57524
C  -2.377805 -1.194752 -0.503461
C  -2.700274 0.316717 -0.581653
C  1.30213 -0.924285 0.893128
C  0.25287 1.468635 -0.475106
C  2.189109 -0.111884 -0.053659
H  -0.700127 -1.087292 1.68729
H  -0.139526 1.292607 1.63591
H  -0.656365 -2.536465 -0.321849
H  -0.373001 -1.14413 -1.381949
H  -2.215885 2.190236 0.454214
H  -2.510212 0.80759 1.530979
H  -2.858258 -1.6225 0.401176
H  -2.812267 -1.72189 -1.374214
H  -2.36473 0.7134 -1.560843
H  -3.795571 0.472142 -0.544708
H  1.571863 -1.985816 0.750755
H  1.637324 -0.655118 1.91603
H  -0.183736 1.187394 -1.449843
H  0.257323 2.568719 -0.397974
