program: Gaussian 09
title: 000183098
version: EM64L-G09RevD.01
frameworkgroup: C1[X(C16H26N2)]
method: RPBEPBE
basis: SDD
operation: Freq
keyword: #pfreq=noraman
keyword: PBEPBE/SDD
title: #p freq=noraman PBEPBE/SDD
converged: YES YES NO NO
title: Mulliken charges:
elementType: N N C C C C C C C C C C C C C C C C H H H H H H H H H H H H H H H H H H H H H H H H H H
charge: -0.222325 -0.096742 -0.063819 -0.349310 0.382452 -0.692921 -0.405308 0.435742 -0.265943 -0.546253 -0.688355 -0.460968 -0.466226 -0.836998 -0.301847 0.403924 -0.802651 -0.789256 0.221424 0.204465 0.201185 0.218946 0.230913 0.213734 0.203843 0.214527 0.205220 0.260450 0.202097 0.220237 0.242327 0.262063 0.208934 0.204743 0.219236 0.251157 0.231914 0.213996 0.220029 0.226773 0.219856 0.233147 0.216945 0.218641
chargesum: 0.00000
title: Mulliken charges with hydrogens summed into heavy atoms:
elementType: N N C C C C C C C C C C C C C C C C
charge: -0.222325 -0.096742 0.157605 0.056339 0.382452 -0.029328 -0.201465 0.435742 -0.005493 -0.126505 -0.023694 -0.198905 -0.052549 -0.134690 -0.087851 0.403924 -0.135993 -0.120522
polarizability: 2.15823111e+02 -1.64768874e+01 1.92697873e+02 2.12038246e+01 -1.93720486e+00 1.59138627e+02
1716.lowfreq: -17.8336 -9.1544 -0.0009 -0.0007 -0.0005 2.5823 7.8985 15.0770 34.9150
frequency: -8.9654 14.5313 34.4912 43.4438 55.2325 74.4226 78.6323 91.3683 106.7649 130.1194 145.6539 171.7667 188.2325 200.1563 211.7454 213.9319 231.1479 248.3724 297.8242 301.3889 317.3419 333.3035 355.9058 389.9738 419.4051 436.9559 466.6542 483.6387 506.3771 518.1563 558.4323 612.2788 654.2547 665.4011 750.2695 762.6863 771.7250 798.3976 803.8325 810.8212 838.7560 844.7069 846.6013 879.8911 899.1699 945.0310 947.9291 961.8414 987.0678 990.3592 992.9251 996.8089 1028.1112 1030.4733 1045.8713 1081.1387 1087.9006 1097.6343 1112.0010 1120.0580 1124.5708 1149.4075 1165.6036 1189.7213 1201.8763 1219.0590 1235.7792 1242.8652 1264.6720 1285.7026 1292.6611 1294.0207 1315.8658 1329.3746 1340.3103 1357.2150 1374.4246 1387.0199 1388.6084 1391.8625 1395.2250 1396.5214 1404.9144 1428.9688 1453.2806 1455.3416 1460.8531 1461.2708 1467.0729 1468.7806 1470.5472 1472.2677 1474.2611 1476.5636 1478.1380 1480.8569 1485.9488 1515.6462 1663.3989 1693.9043 2953.5771 2959.2412 2963.0095 2967.1384 2980.0170 2981.2575 2982.2106 2984.8294 3022.3464 3023.5872 3029.3943 3030.6279 3034.6693 3039.8052 3043.9611 3068.3665 3074.3933 3075.8700 3076.7687 3082.6743 3086.1869 3087.4032 3089.4034 3099.0566 3229.7862 3236.3736
redmass: 3.5176 3.5509 2.9380 3.2895 2.9288 2.6666 2.4288 1.5940 2.1894 2.0710 2.1138 1.6914 1.6553 1.6012 1.3605 1.4617 1.7060 1.6627 2.6320 2.8942 2.5926 2.7913 2.4243 2.7557 2.5080 2.8472 2.4128 3.1470 2.5059 3.4372 2.3896 2.4740 3.0719 3.4059 2.5262 1.6993 2.3886 1.3954 2.5251 1.5039 1.8792 1.4401 1.7824 2.0526 3.8601 1.4664 1.7321 1.3034 1.5795 1.8068 1.3544 1.8165 2.7130 1.5342 1.8123 1.6737 1.6571 2.0064 2.1019 2.4403 2.5675 1.7554 1.8539 1.6079 1.4739 1.7408 2.0291 1.7625 1.9982 1.8860 1.3966 1.2957 1.8284 2.7139 1.5141 1.4254 1.5513 1.3197 1.2146 1.2940 1.2336 1.2324 1.5217 3.1617 1.0531 1.0707 1.0696 1.0715 1.0510 1.0880 1.0646 1.0688 1.0704 1.0557 1.0480 1.0758 1.0548 5.7429 7.2814 6.4793 1.0373 1.0392 1.0391 1.0603 1.0436 1.0473 1.0620 1.0416 1.0903 1.0962 1.0964 1.1002 1.0945 1.0953 1.0965 1.0933 1.0994 1.0988 1.0961 1.0983 1.0994 1.0893 1.1000 1.0951 1.0946 1.1005
irintensity: 0.6653 0.1240 0.4007 0.2065 0.1502 0.4704 1.8108 0.2227 0.2244 0.0753 1.1388 0.1683 0.3261 0.1129 0.2089 0.6638 0.1271 0.1762 0.7145 0.5682 0.1579 4.5523 0.3681 1.5865 2.9549 0.9907 4.0410 2.3199 3.1954 0.8243 7.8845 2.8184 18.9364 1.6568 5.5746 19.4686 7.0325 9.1279 9.8946 8.5772 15.8301 10.4745 15.7915 3.4904 15.9483 2.5790 1.0121 5.3845 10.2964 13.4383 4.2445 1.3615 3.3368 8.9445 16.2978 6.0756 3.8907 3.2684 8.7683 22.6556 10.0603 4.1082 1.2745 5.5990 4.4678 36.8451 2.6805 0.1883 15.9545 5.7042 1.7113 3.6226 7.3563 8.0152 2.0422 1.2614 3.0975 14.8031 12.7221 28.2310 14.2671 17.7973 2.1846 46.6167 1.3654 5.7966 10.4689 12.3651 4.3819 5.6033 42.5231 17.4398 3.6877 1.7216 17.5764 16.9269 15.2558 1.3435 7.8213 3.0463 36.4478 31.2967 40.5523 29.4860 29.2968 14.6827 89.2800 28.5514 3.9715 22.3117 50.4774 21.8079 26.1221 10.4382 22.6439 17.7512 34.7893 14.3695 51.2056 19.4991 27.0640 69.5137 41.9521 30.8346 5.2298 2.3246
temp: 298.150 k
press: 1.00000 atm
elementType: 7 7 6 6 6 6 6 6 6 6 6 6 6 6 6 6 6 6 1 1 1 1 1 1 1 1 1 1 1 1 1 1 1 1 1 1 1 1 1 1 1 1 1 1
symmnumber: 1
zpe: 1006930.6 jmol-1
zpe.correction: 0.383520 hartree
zpe.thermalcorrener: 0.404065 hartree
zpe.thermalcorrenthalpy: 0.405009 hartree
zpe.thermalcorrgfe: 0.333021 hartree
zpe.sumelectzpe: -733.370314 hartree
zpe.sumelectthermal: -733.349769 hartree
zpe.sumelectthermalent: -733.348825 hartree
zpe.sumelectthermalfe: -733.420812 hartree
dipole: 2.2109 3.5913 1.6090
dipole: 4.5138
quadrupole: -116.8077 -111.2972 -113.2566
quadrupole: -16.2077 -4.6712 -4.0491
quadrupole: -3.0205 2.4899 0.5305 -16.2077 -4.6712 -4.0491
hfenergy: -733.7538332 hartree
pointgroup: C01 [X(C16H26N2)]
dipole: 1.4013337 0.8879181 0.6337164 debye
polarizability: 198.4324922|-19.3004246|210.1534923|18.1502315|-10.9232802|159.0736266 unknown
InChI: InChI=1S/C16H26N2/c1-6-15(5)18-12-17-11-16(18)10-14(4)9-7-8-13(2)3/h8,10-12,15H,6-7,9H2,1-5H3
charge 0 multiplicity 1
44 atoms
N  -1.687688 0.870227 -0.47107
N  -3.316486 -0.382158 -1.446269
C  -0.920671 2.08308 -0.079601
C  -1.72083 2.946589 0.930931
C  -1.332623 -0.486871 -0.245131
C  -0.499534 2.886587 -1.331316
C  -0.157422 -0.878824 0.530173
C  0.569023 -2.036603 0.415191
C  -2.876273 0.869207 -1.195319
C  1.769446 -2.27843 1.318478
C  -2.063437 2.20397 2.238558
C  -2.364933 -1.224863 -0.862834
C  3.13946 -1.964832 0.61415
C  0.277555 -3.117019 -0.609011
C  3.406736 -0.479337 0.486241
C  3.319255 0.300617 -0.630492
C  3.614641 1.791747 -0.564421
C  2.934227 -0.205993 -2.009094
H  -0.003265 1.722096 0.419768
H  -2.650576 3.303231 0.445019
H  -1.117299 3.848426 1.154908
H  -1.377219 3.310886 -1.851529
H  0.044905 2.243264 -2.044785
H  0.159994 3.724216 -1.040523
H  0.177957 -0.164765 1.296273
H  1.697452 -1.660649 2.233864
H  1.784217 -3.339335 1.64236
H  -3.377323 1.777731 -1.520115
H  -1.146352 1.88202 2.767672
H  -2.63602 2.854231 2.923901
H  -2.671429 1.304242 2.036307
H  -2.494136 -2.303948 -0.877227
H  3.944537 -2.425535 1.221545
H  3.163964 -2.467088 -0.370371
H  1.210028 -3.619288 -0.928664
H  -0.231015 -2.714555 -1.502476
H  -0.376874 -3.904501 -0.183145
H  3.685704 0.018587 1.42927
H  4.447207 2.063727 -1.243788
H  3.887976 2.112884 0.456087
H  2.737017 2.386244 -0.891586
H  2.734141 -1.288774 -2.032315
H  3.733153 0.01438 -2.745058
H  2.020315 0.308178 -2.368752
