program: Gaussian 09
title: 000183135
version: EM64L-G09RevD.01
frameworkgroup: C1[X(C20H32O3)]
method: RPBEPBE
basis: SDD
operation: Freq
keyword: #pfreq=noraman
keyword: PBEPBE/SDD
title: #p freq=noraman PBEPBE/SDD
converged: YES YES NO NO
title: Mulliken charges:
elementType: O O O C C C C C C C C C C C C C C C C C C C C H H H H H H H H H H H H H H H H H H H H H H H H H H H H H H H H
charge: -0.483800 -0.403811 -0.287791 -0.026408 -0.408270 -0.403096 -0.451478 -0.689778 -0.181518 -0.174466 -0.399925 -0.466574 -0.545031 -0.474882 -0.193739 -0.166313 -0.540717 -0.146830 -0.532832 -0.171747 -0.160543 -0.159940 0.232224 0.185707 0.189715 0.208310 0.206111 0.191866 0.199010 0.222322 0.207938 0.236352 0.204120 0.217527 0.364849 0.227465 0.230475 0.220508 0.209174 0.221024 0.204828 0.205803 0.257245 0.264459 0.224498 0.233764 0.209136 0.203909 0.236008 0.208031 0.204665 0.220324 0.221826 0.222157 0.378135
chargesum: 0.00000
title: Mulliken charges with hydrogens summed into heavy atoms:
elementType: O O O C C C C C C C C C C C C C C C C C C C C
charge: -0.118951 -0.025676 -0.287791 0.159300 -0.010244 -0.005118 -0.030146 -0.041367 0.036009 0.052999 0.051057 -0.036376 -0.134400 0.046823 0.030758 0.067452 -0.127673 0.089179 -0.120136 0.048577 0.061283 0.062217 0.232224
polarizability: 2.90673835e+02 1.60848786e+00 2.24941539e+02 9.55326325e-01 1.00379606e+00 1.84856758e+02
1716.lowfreq: -6.1896 -5.0784 0.0003 0.0006 0.0007 6.7739 12.9252 20.1225 24.9965
frequency: 11.5292 19.2871 24.8682 33.1112 37.4404 46.5770 56.6538 65.2498 74.3956 80.4350 95.8837 101.2227 118.1206 135.6843 139.2716 155.5676 160.8705 167.7276 187.2487 200.1690 208.6234 221.0334 245.6415 249.2036 259.7243 282.2236 297.5452 324.2268 335.9574 379.0700 401.8224 405.9203 415.8698 430.0389 474.8240 489.2668 501.3139 506.1179 533.5062 536.8878 551.3333 623.3280 686.7749 710.7669 755.7143 760.5242 766.3605 779.0710 796.8245 811.6474 826.3391 833.0361 843.6878 851.9488 876.0565 901.9176 919.4748 922.5473 939.7602 964.3748 968.5233 974.9393 979.1830 980.9050 984.4129 1002.0932 1005.6739 1029.7456 1037.1929 1048.2361 1052.8225 1059.5586 1069.6025 1079.5042 1088.8105 1096.3853 1101.5747 1106.8376 1111.8680 1122.5706 1135.1910 1158.1427 1179.2315 1181.7168 1198.3777 1203.3401 1227.8516 1241.3998 1246.4810 1253.1092 1255.9456 1264.0911 1269.0751 1284.3693 1288.7562 1290.3881 1291.7923 1294.8620 1296.5625 1308.1743 1313.5070 1317.2708 1330.2103 1335.3790 1336.8491 1342.1353 1343.3931 1347.7582 1349.3137 1384.8356 1396.3508 1450.2290 1453.7363 1454.5185 1455.6484 1459.6074 1463.2760 1464.1596 1465.5008 1469.6667 1472.8693 1486.5504 1628.4049 1668.9573 1677.0044 1682.6187 1686.3804 2952.7008 2953.4425 2955.6876 2960.0339 2963.1844 2966.0815 2977.9877 2978.8030 2991.6655 2993.5624 3011.8672 3020.0260 3022.2967 3025.2700 3033.5100 3035.1729 3040.4347 3040.5964 3055.0413 3060.9617 3070.0459 3070.5010 3071.0078 3075.2723 3079.2679 3082.2028 3086.7513 3087.3540 3090.2690 3095.8287 3347.5778 3492.2367
redmass: 4.5253 3.8543 5.5136 4.7587 5.2352 4.2708 3.9761 3.6445 4.9791 3.1270 3.3139 2.9626 2.0325 2.2274 2.2895 2.8371 3.3075 2.6672 3.1645 1.5651 2.0495 2.8437 2.7199 3.2483 2.4852 2.4753 3.4055 3.3106 2.5853 3.1309 2.9004 2.7117 2.3271 2.1589 2.3950 2.5218 2.4238 2.3659 2.9283 3.7518 2.3578 1.3696 1.0692 2.8804 1.3075 1.7360 1.4647 1.6439 1.7301 1.9637 1.9420 2.4744 1.8718 2.1119 1.9107 1.9972 2.0617 2.1393 1.8799 1.3949 1.2450 1.1229 1.1886 1.1705 2.0189 3.2415 1.9450 2.1285 3.0664 2.6669 2.1069 3.2045 2.3729 1.9844 2.1688 2.0199 2.2688 1.8269 2.3206 2.1334 1.3134 1.5639 1.3983 1.2664 1.3119 1.2521 1.2622 1.2439 1.2532 1.3080 1.2535 1.1424 1.2619 1.2653 1.2457 1.2571 1.2893 1.2729 1.2692 1.2769 1.3150 1.3779 1.3689 1.2278 1.4069 1.3890 1.4667 1.6214 1.6396 1.2064 1.2029 1.0812 1.0903 1.0943 1.0951 1.1152 1.0847 1.0979 1.0866 1.0414 1.0966 1.0561 7.0816 6.7258 6.3678 6.3627 6.6033 1.0637 1.0644 1.0635 1.0592 1.0588 1.0598 1.0372 1.0611 1.0852 1.0612 1.0987 1.0993 1.0601 1.0960 1.0949 1.0950 1.0978 1.0986 1.1002 1.0933 1.0996 1.0941 1.0934 1.0936 1.0887 1.0893 1.0884 1.0996 1.0887 1.1045 1.0680 1.0636
irintensity: 1.1071 0.5402 0.2759 0.2923 0.5896 0.4856 0.2933 0.5968 3.1620 0.9974 0.1839 0.9775 0.8589 1.5251 0.1834 1.4623 1.4737 0.1715 0.1535 2.4028 2.3885 2.0405 1.0641 1.5849 2.9565 3.5751 11.3418 1.5451 0.3423 4.1591 2.7940 6.2019 2.8814 9.3787 0.2992 3.4461 2.3457 1.3693 3.4604 34.2919 0.5892 88.8156 233.4724 56.2230 9.6108 4.8376 0.8860 2.6141 1.1279 3.2787 0.5026 4.0142 17.3997 6.5300 15.1598 6.6912 21.6153 11.1042 3.9265 7.1897 9.1745 92.1416 115.1543 53.7418 15.5588 3.9129 7.8717 8.6183 29.8854 6.0567 20.2929 7.5618 6.1516 130.5262 11.9563 23.4695 23.6447 13.6129 11.7340 8.7533 8.1924 15.5809 1.5702 19.5186 3.9859 0.6618 1.1221 7.0945 0.3177 7.5223 1.1511 1.3296 0.6207 0.6317 0.5482 0.7446 6.6506 5.1265 8.0473 2.9334 3.9751 4.4833 1.0236 2.5282 12.9130 2.0883 1.9285 18.3941 10.0921 17.5070 66.3057 0.6764 19.9936 8.8907 12.1251 22.7306 10.7937 7.8754 9.9497 10.8286 16.9253 12.5644 324.2545 0.0396 0.3105 1.5074 0.8072 47.4838 23.1048 45.5203 4.8204 42.6766 52.7775 40.7485 34.6080 27.2578 39.9406 1.9002 16.4577 4.3043 44.4791 16.6431 0.7598 13.6261 72.5761 18.8949 32.6539 53.6664 32.0789 11.5266 9.2041 46.4687 11.8735 39.5679 43.6775 84.3403 2.7238 373.3552 22.2950
temp: 298.150 k
press: 1.00000 atm
elementType: 8 8 8 6 6 6 6 6 6 6 6 6 6 6 6 6 6 6 6 6 6 6 6 1 1 1 1 1 1 1 1 1 1 1 1 1 1 1 1 1 1 1 1 1 1 1 1 1 1 1 1 1 1 1 1
symmnumber: 1
zpe: 1245454.2 jmol-1
zpe.correction: 0.474368 hartree
zpe.thermalcorrener: 0.501923 hartree
zpe.thermalcorrenthalpy: 0.502867 hartree
zpe.thermalcorrgfe: 0.412393 hartree
zpe.sumelectzpe: -1005.115823 hartree
zpe.sumelectthermal: -1005.088268 hartree
zpe.sumelectthermalent: -1005.087324 hartree
zpe.sumelectthermalfe: -1005.177798 hartree
dipole: 2.0236 -0.2851 1.5723
dipole: 2.5785
quadrupole: -149.0386 -138.3011 -134.6975
quadrupole: -5.1374 -7.0541 -3.4488
quadrupole: -8.3595 2.3780 5.9816 -5.1374 -7.0541 -3.4488
hfenergy: -1005.5901912 hartree
pointgroup: C01 [X(C20H32O3)]
dipole: 0.7832774 -0.1172421 -0.6338974 debye
polarizability: 287.5477077|-14.0964409|227.6942172|-2.2976318|-3.4973151|185.230207 unknown
InChI: InChI=1S/C20H32O3/c1-2-19(21)17-15-13-11-9-7-5-3-4-6-8-10-12-14-16-18-20(22)23/h4-7,10-13,19,21-22H,2-3,8-9,14-18H2,1H3
charge 0 multiplicity 1
55 atoms
O  -3.435634 1.397296 0.713643
O  0.487629 1.964641 -2.17777
O  -1.68846 2.083432 -1.430178
C  -4.406312 0.375668 0.273274
C  -3.677916 -0.935731 -0.111523
C  -5.302997 0.913208 -0.866375
C  -2.957753 -1.577806 1.103534
C  -6.118417 2.155505 -0.451274
C  -2.067812 -2.745844 0.735349
C  -0.741251 -2.82997 1.020771
C  0.505448 2.605608 1.038147
C  1.807563 3.314003 0.562189
C  0.169469 -3.997304 0.66663
C  0.080578 1.392747 0.151005
C  3.019287 2.407407 0.66278
C  1.338131 -3.557508 -0.202544
C  4.786513 0.832822 -0.30776
C  3.641578 1.830513 -0.398113
C  3.797442 -3.008072 -0.633544
C  2.633382 -3.517857 0.205268
C  4.351969 -0.526405 -0.838971
C  4.315425 -1.673668 -0.11396
C  -0.4791 1.828949 -1.179662
H  -5.027188 0.197734 1.174134
H  -4.409986 -1.654094 -0.534994
H  -2.943203 -0.715265 -0.912841
H  -4.659723 1.156145 -1.737689
H  -5.98769 0.104332 -1.193098
H  -3.734628 -1.912843 1.824041
H  -2.368789 -0.795535 1.618731
H  -6.688066 2.568014 -1.304227
H  -5.44696 2.941969 -0.06428
H  -6.838428 1.905967 0.350964
H  -2.549206 -3.580415 0.197652
H  -2.914967 1.706078 -0.085292
H  -0.253977 -1.994854 1.549068
H  -0.327021 3.332879 1.093657
H  0.656486 2.218001 2.063907
H  1.953887 4.214314 1.191965
H  1.685569 3.662297 -0.480312
H  0.567573 -4.454467 1.595653
H  -0.42366 -4.777014 0.148339
H  -0.718006 0.835683 0.670788
H  0.952226 0.735547 -0.006575
H  3.368827 2.171411 1.681233
H  1.082261 -3.211409 -1.216043
H  5.646692 1.204479 -0.904524
H  5.131293 0.738925 0.739162
H  3.266912 2.04896 -1.410445
H  4.617072 -3.757215 -0.611134
H  3.484608 -2.899194 -1.689038
H  2.877924 -3.844365 1.229088
H  4.005573 -0.5455 -1.884619
H  4.645633 -1.655616 0.936792
H  0.047201 2.26842 -3.019378
